{"text_format":"1","workbook":"xlsx","n_sheets":15,"sheets":["Cover","Minutes 1","Minutes 2","Minutes 3","Minutes 4","Graphs","Tchr1","Tchr2","Tchr3","Tchr4","Tchr5","Tchr6","Tchr7","Tchr8","Tools"],"not_rendered":{"charts":8,"images":0,"macros":1,"external_links":0,"defined_names":40,"comments":5,"pivot_tables":0},"unopened":[],"bounds":{"document_bytes":16777216,"sheet_cells":100000,"rows_first":2000,"rows_last":500,"rows_between":2000,"halvings":0,"cell_chars":16384,"cell_head_chars":4096},"cells_cut":0,"cells_raw":0,"read":"whole","date_system":"1900"}

{"sheet":"Cover","index":0,"n_rows":24,"n_cols":20,"rows_kept":24,"cut":false,"hidden":false,"merged":[[23,3,23,10],[7,3,7,4],[8,3,8,4],[9,3,9,4],[12,3,12,4],[10,3,10,4],[11,10,11,12],[21,1,22,2],[2,9,2,10],[3,9,3,10],[10,10,10,12],[1,9,1,10],[21,3,21,10],[1,3,1,4],[2,3,2,4],[3,3,3,4],[4,3,4,4],[5,3,5,4],[6,3,6,4],[4,9,4,10],[5,9,5,10],[10,13,10,15],[13,10,13,12],[14,10,14,12],[15,10,15,12],[22,3,22,10],[12,10,12,12],[16,3,16,4],[17,3,17,4],[11,13,11,15],[12,13,12,15],[13,13,13,15],[14,13,14,15],[15,13,15,15]]}
[]
[null,null,"School:",null,null,null,null,null,"Subject:",null,null,"Date:"]
[null,null,"Team:",null,null,null,null,null,"Assessment 1:","CFA 1 Pre"]
[null,null,"Teacher 1:",null,null,null,null,null,"Assessment 2:","CFA 2 Mid",null,null,null,null,null,null,null,null,{"$f":"D4&\", \"","v":", "}]
[null,null,"Teacher 2:",null,null,null,null,null,"Assessment 3:","CFA 3 Post",null,null,null,null,null,null,null,null,", "]
[null,null,"Teacher 3:",null,null,null,null,null,"Assessment 4:","CFA 4",null,null,null,null,null,null,null,null,", "]
[null,null,"Teacher 4:",null,null,null,null,null,null,null,null,null,null,null,null,null,null,null,", "]
[null,null,"Teacher 5:",null,null,null,null,null,null,null,null,null,null,null,null,null,null,null,", "]
[null,null,"Teacher 6:",null,null,null,null,null,null,null,null,null,null,null,null,null,null,null,", "]
[null,null,"Teacher 7:",null,null,null,null,null,null,null,null,null,null,null,null,null,null,null,", "]
[null,null,"Teacher 8:",null,null,null,null,null,null,"Scores:","Label (on minutes):",null,null,"Label (on graphs):",null,null,null,null,", "]
[null,null,null,null,null,null,null,null,"Max Score:",5,null,null,null,null,null,null,null,null,", "]
[null,null,null,null,null,null,null,null,"Min. for Proficiency:",4,"PROFICIENT",null,null,"PROFICIENT",null,null,{"$f":"\"% \" &N13& \" or higher\"","v":"% PROFICIENT or higher"},null,", "]
[null,null,null,null,null,null,null,null,"Close to Proficiency:",3,"CLOSE TO",null,null,"CLOSE TO",null,null,{"$f":"\"% \" &N14","v":"% CLOSE TO"}]
[null,null,null,null,null,null,null,null,"Far to Go But Likely to Be Proficient",2,"PROGRESSING",null,null,"PROGRESSING",null,null,{"$f":"\"% \" &N15","v":"% PROGRESSING"}]
[null,null,null,null,null,null,null,null,"Far to Go Not Likely to Be Proficient",1,"NEEDS PRACTICE",null,null,"NEEDS PRACTICE",null,null,"% NEEDS PRACTICE"]
[null,null,null,null,null,null,null,null,null,null,null,null,null,null,null,null,null,null,{"$f":"D17&\", \"","v":", "}]
[null,null,null,null,null,null,null,null,null,null,null,null,null,null,null,null,null,null,{"$f":"D18&\", \"","v":", "}]
[null,null,null,null,null,null,null,null,null,null,null,null,null,null,null,null,null,null,{"$f":"CONCATENATE(S4,S5,S6,S7,S8,S9,S10,S11,S12,S13,S17,S18)","v":", , , , , , , , , , , , "}]
[null,null,null,null,null,null,null,null,"Minimum % of Students Proficient before moving to next standard:"]
[null,null,null,null,null,null,null,null,null,null,null,null,null,null,null,null,null,null,{"$f":"LEN(S19)","v":24},{"$f":"2*(12-(COUNTA(D4:E18)))+2","v":26}]
[null,"Directions:",null,"Enter data in the cells that are highlighted in light yellow.  All information entered on this page will automatically show up where required.",null,null,null,null,null,null,null,null,null,null,null,null,null,null,{"$f":"IF(T21>S21,\"\",LEFT(S19,S21-T21))","v":""}]
[null,null,null,"Enter the information for your score range in the column above.  The label for each performance range can be changed in the cells to the right of the score.  The labels you use will show up automatically where needed."]
[null,null,null,"Enter scores for each individual student on the appropriate page for each teacher.  All calculations will be performed automatically.",null,null,null,null,null,null,null,null,null,null,null,null,"v. 8T4A175SStf10-26-10"]

{"sheet":"Minutes 1","index":1,"n_rows":153,"n_cols":22,"rows_kept":153,"cut":false,"hidden":false,"merged":[[115,3,115,19],[116,5,116,11],[116,13,116,19],[117,3,117,7],[117,8,117,10],[117,11,117,12],[117,13,117,15],[117,16,117,19],[111,13,111,19],[112,3,112,7],[112,8,112,10],[112,11,112,12],[112,13,112,15],[112,16,112,19],[113,3,113,7],[113,8,113,10],[113,11,113,12],[113,13,113,15],[113,16,113,19],[1,8,1,10],[1,15,1,17],[21,5,21,6],[22,5,22,6],[23,5,23,6],[24,5,24,6],[25,5,25,6],[26,5,26,6],[27,5,27,6],[15,1,15,9],[15,10,15,16],[16,1,16,9],[16,10,16,16],[3,1,3,5],[4,1,4,2],[6,1,6,2],[7,1,7,2],[8,1,8,2],[3,11,3,15],[4,11,4,12],[6,11,6,12],[7,11,7,12],[8,11,8,12],[10,1,10,4],[28,5,28,6],[29,5,29,6],[30,5,30,6],[35,4,35,19],[36,4,36,11],[36,12,36,19],[37,5,37,11],[37,12,37,19],[38,5,38,11],[38,12,38,19],[39,5,39,11],[39,12,39,19],[40,12,40,19],[41,5,41,11],[41,12,41,19],[42,5,42,11],[42,12,42,19],[43,5,43,11],[43,12,43,19],[44,5,44,11],[44,12,44,19],[40,5,40,11],[46,4,46,19],[47,12,47,19],[48,5,48,11],[48,12,48,19],[49,5,49,11],[49,12,49,19],[50,5,50,11],[50,12,50,19],[51,5,51,11],[51,12,51,19],[47,4,47,11],[52,5,52,11],[52,12,52,19],[53,5,53,11],[53,12,53,19],[54,5,54,11],[54,12,54,19],[55,5,55,11],[55,12,55,19],[57,4,57,19],[58,4,58,11],[58,12,58,19],[59,5,59,11],[59,12,59,19],[60,5,60,11],[60,12,60,19],[61,5,61,11],[61,12,61,19],[62,5,62,11],[62,12,62,19],[63,5,63,11],[63,12,63,19],[64,12,64,19],[65,5,65,11],[65,12,65,19],[66,5,66,11],[66,12,66,19],[68,4,68,19],[69,4,69,11],[69,12,69,19],[64,5,64,11],[70,4,70,11],[70,12,70,19],[71,5,71,11],[71,12,71,19],[72,5,72,11],[72,12,72,19],[73,12,73,19],[74,5,74,11],[74,12,74,19],[75,5,75,11],[75,12,75,19],[76,5,76,11],[76,12,76,19],[77,5,77,11],[77,12,77,19],[73,5,73,11],[78,5,78,11],[78,12,78,19],[82,8,82,9],[82,12,82,13],[82,17,82,18],[84,17,84,18],[88,3,88,19],[100,3,100,19],[101,5,101,11],[101,13,101,19],[82,4,82,5],[101,21,101,23],[102,3,102,7],[102,8,102,10],[102,11,102,12],[102,13,102,15],[102,16,102,19],[103,3,103,7],[103,8,103,10],[103,11,103,12],[103,13,103,15],[103,16,103,19],[118,13,118,15],[118,16,118,19],[121,2,121,19],[123,3,123,19],[105,3,105,19],[106,5,106,11],[106,13,106,19],[107,3,107,7],[107,8,107,10],[107,11,107,12],[107,13,107,15],[107,16,107,19],[108,3,108,7],[108,8,108,10],[108,11,108,12],[108,13,108,15],[108,16,108,19],[110,3,110,19],[111,5,111,11],[124,3,124,4],[124,5,124,11],[124,13,124,19],[125,3,125,4],[125,5,125,19],[118,3,118,7],[118,8,118,10],[118,11,118,12],[128,7,128,19],[126,3,128,3],[126,4,126,6],[126,7,126,19],[127,4,127,6],[127,7,127,19],[128,4,128,6],[130,3,130,19],[131,3,131,4],[131,5,131,11],[131,13,131,19],[132,3,132,4],[132,5,132,19],[133,3,135,3],[133,4,133,6],[133,7,133,19],[134,4,134,6],[134,7,134,19],[135,4,135,6],[135,7,135,19],[137,3,137,19],[138,3,138,4],[138,5,138,11],[138,13,138,19],[139,3,139,4],[139,5,139,19],[140,3,142,3],[140,4,140,6],[140,7,140,19],[141,4,141,6],[141,7,141,19],[142,4,142,6],[142,7,142,19],[144,3,144,19],[145,3,145,4],[145,5,145,11],[145,13,145,19],[146,3,146,4],[146,5,146,19],[147,3,149,3],[147,4,147,6],[147,7,147,19],[148,4,148,6],[148,7,148,19],[149,4,149,6],[149,7,149,19],[10,5,10,16],[11,1,11,10],[11,11,11,16],[12,1,12,9],[12,10,12,16],[13,1,13,9],[13,10,13,16],[14,1,14,9],[14,10,14,16]]}
[]
[null,null,null,"Team:",{"$f":"IF(Cover!D3=0,\"\",Cover!D3)","v":""},null,null,"Assessment:",{"$f":"IF(Cover!J3=0,\"\",Cover!J3)","v":"CFA 1 Pre"},null,null,null,null,null,"Date of Meeting:"]
[null,null,null,"Team Members:",{"$f":"Cover!S22","v":""}]
[null,null,null,null,null,null,null,null,null,null,null,"Please place a X in row for rating."]
[null,null,null,null,null,null,null,null,null,null,null,"Norms",null,"Low ",null,null,"High"]
[null,null,null,null,null,null,null,null,null,null,null,"Meeting Rating",null,1,2,3,4]
[null,null,null,null,null,null,null,null,null,null,null,"Preparation"]
[null,null,null,null,null,null,null,null,null,null,null,"Respect"]
[null,null,null,null,null,null,null,null,null,null,null,"Time on Task"]
[null,null,null,null,null,null,null,null,null,null,null,"Active Participation"]
[null,"Priority Standard:"]
[null,"Skills (Verbs)    DOK = ",null,null,null,null,null,null,null,null,null,"Concepts (Nouns)"]
[]
[]
[]
[]
[]
[]
[]
[null,"Step 1: Collect and Chart Data"]
[]
[null,null,null,null,null,"Teacher",null,"# Students",{"$f":" \"# \" & Cover!$K13 & \" and Higher\"","v":"# PROFICIENT and Higher"},{"$f":" \"% \" & Cover!$K13 & \" and Higher\"","v":"% PROFICIENT and Higher"},{"$f":" \"# \" & Cover!$K14","v":"# CLOSE TO"},{"$f":" \"% \" & Cover!$K14","v":"% CLOSE TO"},{"$f":" \"# \" & Cover!$K15","v":"# PROGRESSING"},{"$f":" \"% \" & Cover!$K15","v":"% PROGRESSING"},{"$f":" \"# \" & Cover!$K16","v":"# NEEDS PRACTICE"},{"$f":" \"% \" & Cover!$K16","v":"% NEEDS PRACTICE"}]
[null,null,null,null,null,{"$f":"Cover!D4","v":0},null,{"$f":"Tchr1!$E$4","v":0},{"$f":"Tchr1!$E$5","v":0},{"$f":"IF(H23=0,0,(I23/H23))","v":0},{"$f":"Tchr1!$E$7","v":0},{"$f":"IF(K23=0,0,(K23/H23))","v":0},{"$f":"Tchr1!$E$9","v":0},{"$f":"IF(M23=0,0,(M23/H23))","v":0},{"$f":"Tchr1!$E$11","v":0},{"$f":"IF(O23=0,0,(O23/H23))","v":0}]
[null,null,null,null,null,{"$f":"Cover!D5","v":0},null,{"$f":"Tchr2!$E$4","v":0},{"$f":"Tchr2!$E$5","v":0},{"$f":"IF(H24=0,0,(I24/H24))","v":0},{"$f":"Tchr2!$E$7","v":0},{"$f":"IF(K24=0,0,(K24/H24))","v":0},{"$f":"Tchr2!$E$9","v":0},{"$f":"IF(M24=0,0,(M24/H24))","v":0},{"$f":"Tchr2!$E$11","v":0},0]
[null,null,null,null,null,{"$f":"Cover!D6","v":0},null,{"$f":"Tchr3!$E$4","v":0},{"$f":"Tchr3!$E$5","v":0},0,{"$f":"Tchr3!$E$7","v":0},0,{"$f":"Tchr3!$E$9","v":0},0,{"$f":"Tchr3!$E$11","v":0},0]
[null,null,null,null,null,{"$f":"Cover!D7","v":0},null,{"$f":"Tchr4!$E$4","v":0},{"$f":"Tchr4!$E$5","v":0},0,{"$f":"Tchr4!$E$7","v":0},0,{"$f":"Tchr4!$E$9","v":0},0,{"$f":"Tchr4!$E$11","v":0},0]
[null,null,null,null,null,{"$f":"Cover!D8","v":0},null,{"$f":"Tchr5!$E$4","v":0},{"$f":"Tchr5!$E$5","v":0},0,{"$f":"Tchr5!$E$7","v":0},0,{"$f":"Tchr5!$E$9","v":0},0,{"$f":"Tchr5!$E$11","v":0},0]
[null,null,null,null,null,{"$f":"Cover!D9","v":0},null,{"$f":"Tchr6!$E$4","v":0},{"$f":"Tchr6!$E$5","v":0},0,{"$f":"Tchr6!$E$7","v":0},0,{"$f":"Tchr6!$E$9","v":0},0,{"$f":"Tchr6!$E$11","v":0},0]
[null,null,null,null,null,{"$f":"Cover!D10","v":0},null,{"$f":"Tchr7!$E$4","v":0},{"$f":"Tchr7!$E$5","v":0},0,{"$f":"Tchr7!$E$7","v":0},0,{"$f":"Tchr7!$E$9","v":0},0,{"$f":"Tchr7!$E$11","v":0},0]
[null,null,null,null,null,{"$f":"Cover!D11","v":0},null,{"$f":"Tchr8!$E$4","v":0},{"$f":"Tchr8!$E$5","v":0},0,{"$f":"Tchr8!$E$7","v":0},0,{"$f":"Tchr8!$E$9","v":0},0,{"$f":"Tchr8!$E$11","v":0},0]
[null,null,null,null,null,"TEAM",null,{"$f":"SUM(H23:H28)","v":0},{"$f":"SUM(I23:I28)","v":0},{"$f":"IF(H31=0,0,(I31/H31))","v":0},{"$f":"SUM(K23:K28)","v":0},{"$f":"IF(K31=0,0,(K31/H31))","v":0},{"$f":"SUM(M23:M28)","v":0},{"$f":"IF(M31=0,0,(M31/H31))","v":0},{"$f":"SUM(O23:O28)","v":0},0]
[]
[null,"Step 2: Analysis - Identify Strengths and Performance Errors or Misconceptions"]
[null,null,"Identify the prioritized need for each group of students by placing a 1 in the column next to that need."]
[]
[null,null,null,null,{"$f":"\"Students \" &Cover!K13 & \" or Higher\"","v":"Students PROFICIENT or Higher"}]
[null,null,null,null,"Next Steps",null,null,null,null,null,null,null,"Inference"]
[null,null,null,null,null,null,null,null,null,null,null,null,null,null,null,null,null,null,null,null,null,{"$f":"SUM(E38:E45)","v":0}]
[]
[]
[]
[]
[]
[]
[]
[]
[null,null,null,null,{"$f":"\"Students \" &Cover!K14","v":"Students CLOSE TO"}]
[null,null,null,null,"Performance Errors and/or Misconceptions",null,null,null,null,null,null,null,"Inference"]
[null,null,null,null,null,null,null,null,null,null,null,null,null,null,null,null,null,null,null,null,null,{"$f":"SUM(E49:E56)","v":0}]
[]
[]
[]
[]
[]
[]
[]
[]
[null,null,null,null,{"$f":"\"Students \" &Cover!K15","v":"Students PROGRESSING"}]
[null,null,null,null,"Performance Errors and/or Misconceptions",null,null,null,null,null,null,null,"Inference"]
[null,null,null,null,null,null,null,null,null,null,null,null,null,null,null,null,null,null,null,null,null,{"$f":"SUM(E60:E67)","v":0}]
[]
[]
[]
[]
[]
[]
[]
[]
[null,null,null,null,{"$f":"\"Students \" &Cover!K16","v":"Students NEEDS PRACTICE"}]
[]
[null,null,null,null,"Performance Errors and/or Misconceptions",null,null,null,null,null,null,null,"Inference"]
[null,null,null,null,null,null,null,null,null,null,null,null,null,null,null,null,null,null,null,null,null,{"$f":"SUM(E72:E79)","v":0}]
[]
[]
[]
[]
[]
[]
[]
[]
[null,"Step 3: SMART Goal Statement"]
[null,null,null,null,null,null,null,null,null,null,null,{"$f":"ROUND(MID(E85*100,1,5),1)&\"%\"","v":"0%"},{"$f":"ROUND(MID(N85*100,1,5),0)&\"%\"","v":"0%"}]
[null,null,null,"Group:",null,null,null,"Topic:",null,null,null,"End of Unit Date:",null,null,null,null,"Assessment Tool:"]
[]
[null,null,null,"Current Proficiency:",{"$f":"J31","v":0},null,"Projected Goal:",{"$f":"J31+L31+N31","v":0},null,"Adjustment:",null,null,"Modified Goal:",{"$f":"H85+K85","v":0},null,null,"Assessment Date:"]
[]
[]
[]
[null,null,null,{"$f":"\"The percentage of \"&E83&\" students proficient or higher in \"&I83&\" will increase from \"&L82&\" to \"&M82&\" by \"&M83&\" as measured by a(n) \"&R83&\" given on \"&R85&\".\"","v":"The percentage of  students proficient or higher in  will increase from 0% to 0% by  as measured by a(n)  given on ."}]
[]
[]
[]
[null,"Step 4: Select Instructional Strategies",null,null,null,null,null,null,"Review the list below and record selected strategies in the chart."]
[null,null,"Possible Strategies to Consider:"]
[null,null,"Compare",null,"Classify",null,"Create Metaphors",null,"Create Analogies",null,"Non-Linguistic Representations/Visual Tools",null,null,null,null,null,"Writing"]
[null,null,"Reinforce Effort*",null,"Provide Recognition",null,"Homework*",null,"Practice*",null,"Note-Taking",null,null,"Advanced Organizers",null,null,"Provide Feedback*"]
[null,null,null,null,null,null,null,null,"Generate/Test Hypotheses","Cue","Question","Summarize",null,"Set Objectives*",null,null,"Cooperative Learning"]
[null,null," * = Strategies recommended for daily use"]
[]
[]
[null,null,null,{"$f":"E36","v":"Students PROFICIENT or Higher"}]
[null,null,null,"Identified Need:",null,null,null,null,null,null,null,null,"Inference:"]
[null,null,null,"Selected Instructional Strategy",null,null,null,null,"Learning Environment",null,null,"Time - Duration of the Teaching of Specific Concepts and Skills",null,"Materials for Teachers and Students",null,null,"Assignments, Assessments - Where will students be required to use the strategy?"]
[]
[]
[null,null,null,{"$f":"E47","v":"Students CLOSE TO"}]
[null,null,null,"Identified Need:",null,{"$f":"IF(V49=0,\"\",VLOOKUP(1,E49:F56,2,FALSE))","v":""},null,null,null,null,null,null,"Inference:",{"$f":"IF(V49=0,\"\",IF(VLOOKUP(1,E49:T57,9,FALSE)=\"\",\"\",(VLOOKUP(1,E49:T57,9,FALSE))))","v":""}]
[null,null,null,"Selected Instructional Strategy",null,null,null,null,"Learning Environment",null,null,"Time - Duration of the Teaching of Specific Concepts and Skills",null,"Materials for Teachers and Students",null,null,"Assignments, Assessments - Where will students be required to use the strategy?"]
[]
[]
[null,null,null,{"$f":"E58","v":"Students PROGRESSING"}]
[null,null,null,"Identified Need:",null,{"$f":"IF(V60=0,\"\",VLOOKUP(1,E60:F68,2,FALSE))","v":""},null,null,null,null,null,null,"Inference:",{"$f":"IF(V60=0,\"\",IF(VLOOKUP(1,E60:T68,9,FALSE)=\"\",\"\",(VLOOKUP(1,E60:T68,9,FALSE))))","v":""}]
[null,null,null,"Selected Instructional Strategy",null,null,null,null,"Learning Environment",null,null,"Time - Duration of the Teaching of Specific Concepts and Skills",null,"Materials for Teachers and Students",null,null,"Assignments, Assessments - Where will students be required to use the strategy?"]
[]
[]
[null,null,null,{"$f":"E69","v":"Students NEEDS PRACTICE"}]
[null,null,null,"Identified Need:",null,{"$f":"IF(V72=0,\"\",VLOOKUP(1,E72:L79,2,FALSE))","v":""},null,null,null,null,null,null,"Inference:",{"$f":"IF(V72=0,\"\",IF(VLOOKUP(1,E72:T79,9,FALSE)=\"\",\"\",(VLOOKUP(1,E72:T79,9,FALSE))))","v":""}]
[null,null,null,"Selected Instructional Strategy",null,null,null,null,"Learning Environment",null,null,"Time - Duration of the Teaching of Specific Concepts and Skills",null,"Materials for Teachers and Students",null,null,"Assignments, Assessments - Where will students be required to use the strategy?"]
[]
[]
[null,"Step 5: Results Indicators"]
[null,null,"Describe explicit behaviors (both student and adult) we expect to see as a result of implementing the instructional strategies plan. How will you know that the strategies are working? Look-fors and evidence of learning?  What are proficient students able to do successfully?"]
[]
[null,null,null,{"$f":"E36","v":"Students PROFICIENT or Higher"}]
[null,null,null,"Identified Need:",null,null,null,null,null,null,null,null,"Inference:"]
[null,null,null,"Selected Strategy:"]
[null,null,null,"Results Indicators:","Adult Behaviors:"]
[null,null,null,null,"Student Behaviors:"]
[null,null,null,null,"Look-fors in Student Work:"]
[]
[null,null,null,{"$f":"E47","v":"Students CLOSE TO"}]
[null,null,null,"Identified Need:",null,{"$f":"F107","v":""},null,null,null,null,null,null,"Inference:",{"$f":"IF(N107=\"\",\"\",N107)","v":""}]
[null,null,null,"Selected Strategy:",null,{"$f":"IF(D109=\"\",\"\",D109)","v":""}]
[null,null,null,"Results Indicators:","Adult Behaviors:"]
[null,null,null,null,"Student Behaviors:"]
[null,null,null,null,"Look-fors in Student Work:"]
[]
[null,null,null,{"$f":"E58","v":"Students PROGRESSING"}]
[null,null,null,"Identified Need:",null,{"$f":"F112","v":""},null,null,null,null,null,null,"Inference:",{"$f":"IF(N112=\"\",\"\",N112)","v":""}]
[null,null,null,"Selected Strategy:",null,{"$f":"IF(D114=\"\",\"\",D114)","v":""}]
[null,null,null,"Results Indicators:","Adult Behaviors:"]
[null,null,null,null,"Student Behaviors:"]
[null,null,null,null,"Look-fors in Student Work:"]
[]
[null,null,null,{"$f":"E69","v":"Students NEEDS PRACTICE"}]
[null,null,null,"Identified Need:",null,{"$f":"F117","v":""},null,null,null,null,null,null,"Inference:",{"$f":"IF(N117=\"\",\"\",N117)","v":""}]
[null,null,null,"Selected Strategy:",null,{"$f":"IF(D119=\"\",\"\",D119)","v":""}]
[null,null,null,"Results Indicators:","Adult Behaviors:"]
[null,null,null,null,"Student Behaviors:"]
[null,null,null,null,"Look-fors in Student Work:"]
[]
[]
[null,null,null,"Notes:"]

{"sheet":"Minutes 2","index":2,"n_rows":152,"n_cols":22,"rows_kept":152,"cut":false,"hidden":false,"merged":[[144,13,144,19],[145,3,145,4],[105,5,105,11],[106,3,106,7],[106,8,106,10],[106,11,106,12],[107,3,107,7],[107,8,107,10],[107,11,107,12],[124,3,124,4],[107,16,107,19],[109,3,109,19],[110,5,110,11],[110,13,110,19],[111,3,111,7],[111,8,111,10],[111,11,111,12],[111,13,111,15],[111,16,111,19],[112,3,112,7],[112,8,112,10],[112,11,112,12],[112,13,112,15],[112,16,112,19],[104,3,104,19],[105,13,105,19],[106,13,106,15],[106,16,106,19],[107,13,107,15],[1,8,1,10],[1,15,1,17],[21,5,21,6],[22,5,22,6],[23,5,23,6],[24,5,24,6],[25,5,25,6],[26,5,26,6],[27,5,27,6],[28,5,28,6],[29,5,29,6],[30,5,30,6],[35,4,35,19],[36,4,36,11],[36,12,36,19],[37,5,37,11],[37,12,37,19],[38,5,38,11],[38,12,38,19],[39,5,39,11],[39,12,39,19],[40,5,40,11],[40,12,40,19],[41,5,41,11],[41,12,41,19],[42,5,42,11],[42,12,42,19],[43,5,43,11],[43,12,43,19],[44,5,44,11],[44,12,44,19],[46,4,46,19],[47,4,47,11],[47,12,47,19],[48,5,48,11],[48,12,48,19],[49,5,49,11],[49,12,49,19],[50,5,50,11],[50,12,50,19],[51,5,51,11],[51,12,51,19],[52,5,52,11],[52,12,52,19],[53,5,53,11],[53,12,53,19],[54,5,54,11],[54,12,54,19],[55,5,55,11],[55,12,55,19],[57,4,57,19],[58,4,58,11],[58,12,58,19],[59,12,59,19],[60,5,60,11],[60,12,60,19],[61,5,61,11],[61,12,61,19],[62,5,62,11],[62,12,62,19],[63,5,63,11],[63,12,63,19],[59,5,59,11],[64,12,64,19],[65,5,65,11],[65,12,65,19],[66,5,66,11],[66,12,66,19],[68,4,68,19],[64,5,64,11],[69,4,69,11],[69,12,69,19],[70,5,70,11],[70,12,70,19],[71,5,71,11],[71,12,71,19],[72,12,72,19],[73,5,73,11],[73,12,73,19],[74,5,74,11],[74,12,74,19],[75,5,75,11],[75,12,75,19],[76,5,76,11],[76,12,76,19],[72,5,72,11],[77,12,77,19],[81,8,81,9],[81,12,81,13],[81,17,81,18],[83,17,83,18],[87,3,87,19],[99,3,99,19],[100,5,100,11],[100,13,100,19],[81,4,81,5],[77,5,77,11],[100,21,100,23],[101,3,101,7],[101,8,101,10],[101,11,101,12],[101,13,101,15],[101,16,101,19],[102,3,102,7],[102,8,102,10],[102,11,102,12],[102,13,102,15],[102,16,102,19],[114,3,114,19],[115,5,115,11],[115,13,115,19],[116,3,116,7],[116,8,116,10],[116,11,116,12],[116,13,116,15],[116,16,116,19],[117,3,117,7],[117,8,117,10],[117,11,117,12],[117,13,117,15],[117,16,117,19],[120,2,120,19],[122,3,122,19],[123,3,123,4],[123,5,123,11],[123,13,123,19],[124,5,124,19],[125,3,127,3],[125,4,125,6],[125,7,125,19],[126,4,126,6],[126,7,126,19],[127,4,127,6],[127,7,127,19],[129,3,129,19],[130,3,130,4],[130,5,130,11],[130,13,130,19],[131,3,131,4],[131,5,131,19],[132,3,134,3],[132,4,132,6],[132,7,132,19],[133,4,133,6],[133,7,133,19],[134,4,134,6],[134,7,134,19],[145,5,145,19],[146,3,148,3],[146,4,146,6],[146,7,146,19],[147,4,147,6],[147,7,147,19],[148,4,148,6],[148,7,148,19],[136,3,136,19],[137,3,137,4],[137,5,137,11],[137,13,137,19],[138,3,138,4],[138,5,138,19],[139,3,141,3],[139,4,139,6],[139,7,139,19],[140,4,140,6],[140,7,140,19],[141,4,141,6],[141,7,141,19],[143,3,143,19],[144,3,144,4],[144,5,144,11],[3,1,3,5],[4,1,4,2],[6,1,6,2],[7,1,7,2],[8,1,8,2],[10,1,10,4],[10,5,10,16],[11,1,11,10],[11,11,11,16],[6,11,6,12],[7,11,7,12],[3,11,3,15],[4,11,4,12],[8,11,8,12],[12,1,12,9],[12,10,12,16],[13,1,13,9],[13,10,13,16],[14,1,14,9],[14,10,14,16],[15,1,15,9],[15,10,15,16],[16,1,16,9],[16,10,16,16]]}
[]
[null,null,null,"Team:",{"$f":"IF(Cover!D3=0,\"\",Cover!D3)","v":""},null,null,"Assessment:",{"$f":"IF(Cover!J4=0,\"\",Cover!J4)","v":"CFA 2 Mid"},null,null,null,null,null,"Date of Meeting:"]
[null,null,null,"Team Members:",{"$f":"Cover!S22","v":""}]
[null,null,null,null,null,null,null,null,null,null,null,"Please place a X in row for rating."]
[null,null,null,null,null,null,null,null,null,null,null,"Norms",null,"Low ",null,null,"High"]
[null,null,null,null,null,null,null,null,null,null,null,"Meeting Rating",null,1,2,3,4]
[null,null,null,null,null,null,null,null,null,null,null,"Preparation"]
[null,null,null,null,null,null,null,null,null,null,null,"Respect"]
[null,null,null,null,null,null,null,null,null,null,null,"Time on Task"]
[null,null,null,null,null,null,null,null,null,null,null,"Active Participation"]
[null,"Priority Standard:"]
[null,"Skills (Verbs)    DOK = ",null,null,null,null,null,null,null,null,null,"Concepts (Nouns)"]
[]
[]
[]
[]
[]
[]
[]
[null,"Step 1: Collect and Chart Data"]
[]
[null,null,null,null,null,"Teacher",null,"# Students",{"$f":" \"# \" & Cover!$K13 & \" and Higher\"","v":"# PROFICIENT and Higher"},{"$f":" \"% \" & Cover!$K13 & \" and Higher\"","v":"% PROFICIENT and Higher"},"Change",{"$f":" \"# \" & Cover!$K14","v":"# CLOSE TO"},{"$f":" \"% \" & Cover!$K14","v":"% CLOSE TO"},{"$f":" \"# \" & Cover!$K15","v":"# PROGRESSING"},{"$f":" \"% \" & Cover!$K15","v":"% PROGRESSING"},{"$f":" \"# \" & Cover!$K16","v":"# NEEDS PRACTICE"},{"$f":" \"% \" & Cover!$K16","v":"% NEEDS PRACTICE"}]
[null,null,null,null,null,{"$f":"Cover!D4","v":0},null,{"$f":"Tchr1!$F$4","v":0},{"$f":"Tchr1!$F$5","v":0},{"$f":"IF(H23=0,0,(I23/H23))","v":0},{"$f":"J23-'Minutes 1'!J23","v":0},{"$f":"Tchr1!$F$7","v":0},{"$f":"IF(L23=0,0,(L23/H23))","v":0},{"$f":"Tchr1!$F$9","v":0},{"$f":"IF(N23=0,0,(N23/H23))","v":0},{"$f":"Tchr1!$F$11","v":0},{"$f":"IF(P23=0,0,(P23/H23))","v":0}]
[null,null,null,null,null,{"$f":"Cover!D5","v":0},null,{"$f":"Tchr2!$F$4","v":0},{"$f":"Tchr2!$F$5","v":0},{"$f":"IF(H24=0,0,(I24/H24))","v":0},{"$f":"J24-'Minutes 1'!J24","v":0},{"$f":"Tchr2!$F$7","v":0},0,{"$f":"Tchr2!$F$9","v":0},0,{"$f":"Tchr2!$F$11","v":0},0]
[null,null,null,null,null,{"$f":"Cover!D6","v":0},null,{"$f":"Tchr3!$F$4","v":0},{"$f":"Tchr3!$F$5","v":0},0,{"$f":"J25-'Minutes 1'!J25","v":0},{"$f":"Tchr3!$F$7","v":0},0,{"$f":"Tchr3!$F$9","v":0},0,{"$f":"Tchr3!$F$11","v":0},0]
[null,null,null,null,null,{"$f":"Cover!D7","v":0},null,{"$f":"Tchr4!$F$4","v":0},{"$f":"Tchr4!$F$5","v":0},0,{"$f":"J26-'Minutes 1'!J26","v":0},{"$f":"Tchr4!$F$7","v":0},0,{"$f":"Tchr4!$F$9","v":0},0,{"$f":"Tchr4!$F$11","v":0},0]
[null,null,null,null,null,{"$f":"Cover!D8","v":0},null,{"$f":"Tchr5!$F$4","v":0},{"$f":"Tchr5!$F$5","v":0},0,{"$f":"J27-'Minutes 1'!J27","v":0},{"$f":"Tchr5!$F$7","v":0},0,{"$f":"Tchr5!$F$9","v":0},0,{"$f":"Tchr5!$F$11","v":0},0]
[null,null,null,null,null,{"$f":"Cover!D9","v":0},null,{"$f":"Tchr6!$F$4","v":0},{"$f":"Tchr6!$F$5","v":0},0,{"$f":"J28-'Minutes 1'!J28","v":0},{"$f":"Tchr6!$F$7","v":0},0,{"$f":"Tchr6!$F$9","v":0},0,{"$f":"Tchr6!$F$11","v":0},0]
[null,null,null,null,null,{"$f":"Cover!D10","v":0},null,{"$f":"Tchr7!$F$4","v":0},{"$f":"Tchr7!$F$5","v":0},0,{"$f":"J29-'Minutes 1'!J29","v":0},{"$f":"Tchr7!$F$7","v":0},0,{"$f":"Tchr7!$F$9","v":0},0,{"$f":"Tchr7!$F$11","v":0},0]
[null,null,null,null,null,{"$f":"Cover!D11","v":0},null,{"$f":"Tchr8!$F$4","v":0},{"$f":"Tchr8!$F$5","v":0},0,{"$f":"J30-'Minutes 1'!J30","v":0},{"$f":"Tchr8!$F$7","v":0},0,{"$f":"Tchr8!$F$9","v":0},0,{"$f":"Tchr8!$F$11","v":0},0]
[null,null,null,null,null,"TEAM",null,{"$f":"SUM(H23:H28)","v":0},{"$f":"SUM(I23:I28)","v":0},{"$f":"IF(H31=0,0,(I31/H31))","v":0},{"$f":"J31-'Minutes 1'!J31","v":0},{"$f":"SUM(L23:L28)","v":0},0,{"$f":"SUM(N23:N28)","v":0},0,{"$f":"SUM(P23:P28)","v":0},0]
[]
[null,"Step 2: Analysis - Identify Strengths and Performance Errors or Misconceptions"]
[null,null,"Identify the prioritized need for each group of students by placing a 1 in the column next to that need."]
[]
[null,null,null,null,{"$f":"\"Students \" &Cover!K13 & \" or Higher\"","v":"Students PROFICIENT or Higher"}]
[null,null,null,null,"Next Steps",null,null,null,null,null,null,null,"Inference"]
[null,null,null,null,null,null,null,null,null,null,null,null,null,null,null,null,null,null,null,null,null,{"$f":"SUM(E38:E45)","v":0}]
[]
[]
[]
[]
[]
[]
[]
[]
[null,null,null,null,{"$f":"\"Students \" &Cover!K14","v":"Students CLOSE TO"}]
[null,null,null,null,"Performance Errors and/or Misconceptions",null,null,null,null,null,null,null,"Inference"]
[null,null,null,null,null,null,null,null,null,null,null,null,null,null,null,null,null,null,null,null,null,{"$f":"SUM(E49:E56)","v":0}]
[]
[]
[]
[]
[]
[]
[]
[]
[null,null,null,null,{"$f":"\"Students \" &Cover!K15","v":"Students PROGRESSING"}]
[null,null,null,null,"Performance Errors and/or Misconceptions",null,null,null,null,null,null,null,"Inference"]
[null,null,null,null,null,null,null,null,null,null,null,null,null,null,null,null,null,null,null,null,null,{"$f":"SUM(E60:E67)","v":0}]
[]
[]
[]
[]
[]
[]
[]
[]
[null,null,null,null,{"$f":"\"Students \" &Cover!K16","v":"Students NEEDS PRACTICE"}]
[null,null,null,null,"Performance Errors and/or Misconceptions",null,null,null,null,null,null,null,"Inference"]
[null,null,null,null,null,null,null,null,null,null,null,null,null,null,null,null,null,null,null,null,null,{"$f":"SUM(E71:E78)","v":0}]
[]
[]
[]
[]
[]
[]
[]
[]
[null,"Step 3: SMART Goal Statement"]
[null,null,null,null,null,null,null,null,null,null,null,{"$f":"ROUND(MID(E84*100,1,5),1)&\"%\"","v":"0%"},{"$f":"ROUND(MID(N84*100,1,5),0)&\"%\"","v":"0%"}]
[null,null,null,"Group:",null,null,null,"Topic:",null,null,null,"End of Unit Date:",null,null,null,null,"Assessment Tool:"]
[]
[null,null,null,"Current Proficiency:",{"$f":"J31","v":0},null,"Projected Goal:",{"$f":"J31+M31+O31","v":0},null,"Adjustment:",null,null,"Modified Goal:",{"$f":"H84+K84","v":0},null,null,"Assessment Date:"]
[]
[]
[]
[null,null,null,{"$f":"\"The percentage of \"&E82&\" students proficient or higher in \"&I82&\" will increase from \"&L81&\" to \"&M81&\" by \"&M82&\" as measured by a(n) \"&R82&\" given on \"&R84&\".\"","v":"The percentage of  students proficient or higher in  will increase from 0% to 0% by  as measured by a(n)  given on ."}]
[]
[]
[]
[null,"Step 4: Select Instructional Strategies",null,null,null,null,null,null,"Review the list below and record selected strategies in the chart."]
[null,null,"Possible Strategies to Consider:"]
[null,null,"Compare",null,"Classify",null,"Create Metaphors",null,"Create Analogies",null,"Non-Linguistic Representations/Visual Tools",null,null,null,null,null,"Writing"]
[null,null,"Reinforce Effort*",null,"Provide Recognition",null,"Homework*",null,"Practice*",null,"Note-Taking",null,null,"Advanced Organizers",null,null,"Provide Feedback*"]
[null,null,null,null,null,null,null,null,"Generate/Test Hypotheses","Cue","Question","Summarize",null,"Set Objectives*",null,null,"Cooperative Learning"]
[null,null," * = Strategies recommended for daily use"]
[]
[]
[null,null,null,{"$f":"E36","v":"Students PROFICIENT or Higher"}]
[null,null,null,"Identified Need:",null,{"$f":"IF(V38=0,\"\",VLOOKUP(1,E38:L45,2,FALSE))","v":""},null,null,null,null,null,null,"Inference:",{"$f":"IF(V38=0,\"\",IF(VLOOKUP(1,E38:T46,9,FALSE)=\"\",\"\",(VLOOKUP(1,E38:T46,9,FALSE))))","v":""}]
[null,null,null,"Selected Instructional Strategy",null,null,null,null,"Learning Environment",null,null,"Time - Duration of the Teaching of Specific Concepts and Skills",null,"Materials for Teachers and Students",null,null,"Assignments, Assessments - Where will students be required to use the strategy?"]
[]
[]
[null,null,null,{"$f":"E47","v":"Students CLOSE TO"}]
[null,null,null,"Identified Need:",null,{"$f":"IF(V49=0,\"\",VLOOKUP(1,E49:F56,2,FALSE))","v":""},null,null,null,null,null,null,"Inference:",{"$f":"IF(V49=0,\"\",IF(VLOOKUP(1,E49:T57,9,FALSE)=\"\",\"\",(VLOOKUP(1,E49:T57,9,FALSE))))","v":""}]
[null,null,null,"Selected Instructional Strategy",null,null,null,null,"Learning Environment",null,null,"Time - Duration of the Teaching of Specific Concepts and Skills",null,"Materials for Teachers and Students",null,null,"Assignments, Assessments - Where will students be required to use the strategy?"]
[]
[]
[null,null,null,{"$f":"E58","v":"Students PROGRESSING"}]
[null,null,null,"Identified Need:",null,{"$f":"IF(V60=0,\"\",VLOOKUP(1,E60:F68,2,FALSE))","v":""},null,null,null,null,null,null,"Inference:",{"$f":"IF(V60=0,\"\",IF(VLOOKUP(1,E60:T68,9,FALSE)=\"\",\"\",(VLOOKUP(1,E60:T68,9,FALSE))))","v":""}]
[null,null,null,"Selected Instructional Strategy",null,null,null,null,"Learning Environment",null,null,"Time - Duration of the Teaching of Specific Concepts and Skills",null,"Materials for Teachers and Students",null,null,"Assignments, Assessments - Where will students be required to use the strategy?"]
[]
[]
[null,null,null,{"$f":"E69","v":"Students NEEDS PRACTICE"}]
[null,null,null,"Identified Need:",null,{"$f":"IF(V71=0,\"\",VLOOKUP(1,E71:L78,2,FALSE))","v":""},null,null,null,null,null,null,"Inference:",{"$f":"IF(V71=0,\"\",IF(VLOOKUP(1,E71:T78,9,FALSE)=\"\",\"\",(VLOOKUP(1,E71:T78,9,FALSE))))","v":""}]
[null,null,null,"Selected Instructional Strategy",null,null,null,null,"Learning Environment",null,null,"Time - Duration of the Teaching of Specific Concepts and Skills",null,"Materials for Teachers and Students",null,null,"Assignments, Assessments - Where will students be required to use the strategy?"]
[]
[]
[null,"Step 5: Results Indicators"]
[null,null,"Describe explicit behaviors (both student and adult) we expect to see as a result of implementing the instructional strategies plan. How will you know that the strategies are working? Look-fors and evidence of learning?  What are proficient students able to do successfully?"]
[]
[null,null,null,{"$f":"E36","v":"Students PROFICIENT or Higher"}]
[null,null,null,"Identified Need:",null,{"$f":"IF(F101=\"\",\"\",F101)","v":""},null,null,null,null,null,null,"Inference:",{"$f":"IF(N101=\"\",\"\",N101)","v":""}]
[null,null,null,"Selected Strategy:",null,{"$f":"IF(D103=\"\",\"\",D103)","v":""}]
[null,null,null,"Results Indicators:","Adult Behaviors:"]
[null,null,null,null,"Student Behaviors:"]
[null,null,null,null,"Look-fors in Student Work:"]
[]
[null,null,null,{"$f":"E47","v":"Students CLOSE TO"}]
[null,null,null,"Identified Need:",null,{"$f":"F106","v":""},null,null,null,null,null,null,"Inference:",{"$f":"IF(N106=\"\",\"\",N106)","v":""}]
[null,null,null,"Selected Strategy:",null,{"$f":"IF(D108=\"\",\"\",D108)","v":""}]
[null,null,null,"Results Indicators:","Adult Behaviors:"]
[null,null,null,null,"Student Behaviors:"]
[null,null,null,null,"Look-fors in Student Work:"]
[]
[null,null,null,{"$f":"E58","v":"Students PROGRESSING"}]
[null,null,null,"Identified Need:",null,{"$f":"F111","v":""},null,null,null,null,null,null,"Inference:",{"$f":"IF(N111=\"\",\"\",N111)","v":""}]
[null,null,null,"Selected Strategy:",null,{"$f":"IF(D113=\"\",\"\",D113)","v":""}]
[null,null,null,"Results Indicators:","Adult Behaviors:"]
[null,null,null,null,"Student Behaviors:"]
[null,null,null,null,"Look-fors in Student Work:"]
[]
[null,null,null,{"$f":"E69","v":"Students NEEDS PRACTICE"}]
[null,null,null,"Identified Need:",null,{"$f":"F116","v":""},null,null,null,null,null,null,"Inference:",{"$f":"IF(N116=\"\",\"\",N116)","v":""}]
[null,null,null,"Selected Strategy:",null,{"$f":"IF(D118=\"\",\"\",D118)","v":""}]
[null,null,null,"Results Indicators:","Adult Behaviors:"]
[null,null,null,null,"Student Behaviors:"]
[null,null,null,null,"Look-fors in Student Work:"]
[]
[]
[null,null,null,"Notes:"]

{"sheet":"Minutes 3","index":3,"n_rows":152,"n_cols":22,"rows_kept":152,"cut":false,"hidden":false,"merged":[[146,3,148,3],[146,4,146,6],[146,7,146,19],[147,4,147,6],[147,7,147,19],[148,4,148,6],[148,7,148,19],[143,3,143,19],[144,3,144,4],[144,5,144,11],[144,13,144,19],[145,3,145,4],[145,5,145,19],[139,3,141,3],[139,4,139,6],[139,7,139,19],[140,4,140,6],[140,7,140,19],[141,4,141,6],[141,7,141,19],[136,3,136,19],[137,3,137,4],[137,5,137,11],[137,13,137,19],[138,3,138,4],[138,5,138,19],[132,3,134,3],[132,4,132,6],[132,7,132,19],[133,4,133,6],[133,7,133,19],[134,4,134,6],[134,7,134,19],[129,3,129,19],[130,3,130,4],[130,5,130,11],[130,13,130,19],[131,3,131,4],[131,5,131,19],[125,3,127,3],[125,4,125,6],[125,7,125,19],[126,4,126,6],[126,7,126,19],[127,4,127,6],[127,7,127,19],[122,3,122,19],[123,3,123,4],[123,5,123,11],[123,13,123,19],[124,3,124,4],[124,5,124,19],[117,3,117,7],[117,8,117,10],[117,11,117,12],[117,13,117,15],[117,16,117,19],[120,2,120,19],[115,5,115,11],[115,13,115,19],[116,3,116,7],[116,8,116,10],[116,11,116,12],[116,13,116,15],[116,16,116,19],[112,3,112,7],[112,8,112,10],[112,11,112,12],[112,13,112,15],[112,16,112,19],[114,3,114,19],[110,5,110,11],[110,13,110,19],[111,3,111,7],[111,8,111,10],[111,11,111,12],[111,13,111,15],[111,16,111,19],[107,3,107,7],[107,8,107,10],[107,11,107,12],[107,13,107,15],[107,16,107,19],[109,3,109,19],[105,5,105,11],[105,13,105,19],[106,3,106,7],[106,8,106,10],[106,11,106,12],[106,13,106,15],[106,16,106,19],[102,3,102,7],[102,8,102,10],[102,11,102,12],[102,13,102,15],[102,16,102,19],[104,3,104,19],[99,3,99,19],[100,5,100,11],[100,13,100,19],[100,21,100,23],[101,3,101,7],[101,8,101,10],[101,11,101,12],[101,13,101,15],[101,16,101,19],[81,4,81,5],[81,8,81,9],[81,12,81,13],[81,17,81,18],[83,17,83,18],[87,3,87,19],[75,5,75,11],[75,12,75,19],[76,5,76,11],[76,12,76,19],[77,5,77,11],[77,12,77,19],[72,5,72,11],[72,12,72,19],[73,5,73,11],[73,12,73,19],[74,5,74,11],[74,12,74,19],[69,4,69,11],[69,12,69,19],[70,5,70,11],[70,12,70,19],[71,5,71,11],[71,12,71,19],[68,4,68,19],[64,5,64,11],[64,12,64,19],[65,5,65,11],[65,12,65,19],[66,5,66,11],[66,12,66,19],[61,5,61,11],[61,12,61,19],[62,5,62,11],[62,12,62,19],[63,5,63,11],[63,12,63,19],[58,4,58,11],[58,12,58,19],[59,5,59,11],[59,12,59,19],[60,5,60,11],[60,12,60,19],[57,4,57,19],[53,5,53,11],[53,12,53,19],[54,5,54,11],[54,12,54,19],[55,5,55,11],[55,12,55,19],[50,5,50,11],[50,12,50,19],[51,5,51,11],[51,12,51,19],[52,5,52,11],[52,12,52,19],[47,4,47,11],[47,12,47,19],[48,5,48,11],[48,12,48,19],[49,5,49,11],[49,12,49,19],[46,4,46,19],[42,5,42,11],[42,12,42,19],[43,5,43,11],[43,12,43,19],[44,5,44,11],[44,12,44,19],[39,5,39,11],[39,12,39,19],[40,5,40,11],[40,12,40,19],[41,5,41,11],[41,12,41,19],[36,4,36,11],[36,12,36,19],[37,5,37,11],[37,12,37,19],[38,5,38,11],[38,12,38,19],[35,4,35,19],[1,8,1,10],[1,15,1,17],[21,5,21,6],[22,5,22,6],[23,5,23,6],[24,5,24,6],[3,1,3,5],[4,1,4,2],[6,1,6,2],[7,1,7,2],[8,1,8,2],[10,1,10,4],[10,5,10,16],[11,1,11,10],[11,11,11,16],[12,1,12,9],[12,10,12,16],[13,1,13,9],[3,11,3,15],[4,11,4,12],[8,11,8,12],[6,11,6,12],[7,11,7,12],[25,5,25,6],[26,5,26,6],[27,5,27,6],[28,5,28,6],[29,5,29,6],[30,5,30,6],[13,10,13,16],[14,1,14,9],[14,10,14,16],[15,1,15,9],[15,10,15,16],[16,1,16,9],[16,10,16,16]]}
[]
[null,null,null,"Team:",{"$f":"IF(Cover!D3=0,\"\",Cover!D3)","v":""},null,null,"Assessment:",{"$f":"IF(Cover!J5=0,\"\",Cover!J5)","v":"CFA 3 Post"},null,null,null,null,null,"Date of Meeting:"]
[null,null,null,"Team Members:",{"$f":"Cover!S22","v":""}]
[null,null,null,null,null,null,null,null,null,null,null,"Please place a X in row for rating."]
[null,null,null,null,null,null,null,null,null,null,null,"Norms",null,"Low ",null,null,"High"]
[null,null,null,null,null,null,null,null,null,null,null,"Meeting Rating",null,1,2,3,4]
[null,null,null,null,null,null,null,null,null,null,null,"Preparation"]
[null,null,null,null,null,null,null,null,null,null,null,"Respect"]
[null,null,null,null,null,null,null,null,null,null,null,"Time on Task"]
[null,null,null,null,null,null,null,null,null,null,null,"Active Participation"]
[null,"Priority Standard:"]
[null,"Skills (Verbs)    DOK = ",null,null,null,null,null,null,null,null,null,"Concepts (Nouns)"]
[]
[]
[]
[]
[]
[]
[]
[null,"Step 1: Collect and Chart Data"]
[]
[null,null,null,null,null,"Teacher",null,"# Students",{"$f":" \"# \" & Cover!$K13 & \" and Higher\"","v":"# PROFICIENT and Higher"},{"$f":" \"% \" & Cover!$K13 & \" and Higher\"","v":"% PROFICIENT and Higher"},"Change",{"$f":" \"# \" & Cover!$K14","v":"# CLOSE TO"},{"$f":" \"% \" & Cover!$K14","v":"% CLOSE TO"},{"$f":" \"# \" & Cover!$K15","v":"# PROGRESSING"},{"$f":" \"% \" & Cover!$K15","v":"% PROGRESSING"},{"$f":" \"# \" & Cover!$K16","v":"# NEEDS PRACTICE"},{"$f":" \"% \" & Cover!$K16","v":"% NEEDS PRACTICE"}]
[null,null,null,null,null,{"$f":"Cover!D4","v":0},null,{"$f":"Tchr1!$G$4","v":0},{"$f":"Tchr1!$G$5","v":0},{"$f":"IF(H23=0,0,(I23/H23))","v":0},{"$f":"J23-'Minutes 1'!J23","v":0},{"$f":"Tchr1!$G$7","v":0},{"$f":"IF(L23=0,0,(L23/H23))","v":0},{"$f":"Tchr1!$G$9","v":0},{"$f":"IF(N23=0,0,(N23/H23))","v":0},{"$f":"Tchr1!$G$11","v":0},{"$f":"IF(P23=0,0,(P23/H23))","v":0}]
[null,null,null,null,null,{"$f":"Cover!D5","v":0},null,{"$f":"Tchr2!$G$4","v":0},{"$f":"Tchr2!$G$5","v":0},{"$f":"IF(H24=0,0,(I24/H24))","v":0},{"$f":"J24-'Minutes 1'!J24","v":0},{"$f":"Tchr2!$G$7","v":0},0,{"$f":"Tchr2!$G$9","v":0},0,{"$f":"Tchr2!$G$11","v":0},0]
[null,null,null,null,null,{"$f":"Cover!D6","v":0},null,{"$f":"Tchr3!$G$4","v":0},{"$f":"Tchr3!$G$5","v":0},0,{"$f":"J25-'Minutes 1'!J25","v":0},{"$f":"Tchr3!$G$7","v":0},0,{"$f":"Tchr3!$G$9","v":0},0,{"$f":"Tchr3!$G$11","v":0},0]
[null,null,null,null,null,{"$f":"Cover!D7","v":0},null,{"$f":"Tchr4!$G$4","v":0},{"$f":"Tchr4!$G$5","v":0},0,{"$f":"J26-'Minutes 1'!J26","v":0},{"$f":"Tchr4!$G$7","v":0},0,{"$f":"Tchr4!$G$9","v":0},0,{"$f":"Tchr4!$G$11","v":0},0]
[null,null,null,null,null,{"$f":"Cover!D8","v":0},null,{"$f":"Tchr5!$G$4","v":0},{"$f":"Tchr5!$G$5","v":0},0,{"$f":"J27-'Minutes 1'!J27","v":0},{"$f":"Tchr5!$G$7","v":0},0,{"$f":"Tchr5!$G$9","v":0},0,{"$f":"Tchr5!$G$11","v":0},0]
[null,null,null,null,null,{"$f":"Cover!D9","v":0},null,{"$f":"Tchr6!$G$4","v":0},{"$f":"Tchr5!$G$5","v":0},0,{"$f":"J28-'Minutes 1'!J28","v":0},{"$f":"Tchr6!$G$7","v":0},0,{"$f":"Tchr6!$G$9","v":0},0,{"$f":"Tchr6!$G$11","v":0},0]
[null,null,null,null,null,{"$f":"Cover!D10","v":0},null,{"$f":"Tchr7!$G$4","v":0},{"$f":"Tchr7!$G$5","v":0},0,{"$f":"J29-'Minutes 1'!J29","v":0},{"$f":"Tchr7!$G$7","v":0},0,{"$f":"Tchr7!$G$9","v":0},0,{"$f":"Tchr7!$G$11","v":0},0]
[null,null,null,null,null,{"$f":"Cover!D11","v":0},null,{"$f":"Tchr8!$G$4","v":0},{"$f":"Tchr8!$G$5","v":0},0,{"$f":"J30-'Minutes 1'!J30","v":0},{"$f":"Tchr8!$G$7","v":0},0,{"$f":"Tchr8!$G$9","v":0},0,{"$f":"Tchr8!$G$11","v":0},0]
[null,null,null,null,null,"TEAM",null,{"$f":"SUM(H23:H28)","v":0},{"$f":"SUM(I23:I28)","v":0},{"$f":"IF(H31=0,0,(I31/H31))","v":0},{"$f":"J31-'Minutes 1'!J31","v":0},{"$f":"SUM(L23:L28)","v":0},0,{"$f":"SUM(N23:N28)","v":0},0,{"$f":"SUM(P23:P28)","v":0},0]
[]
[null,"Step 2: Analysis - Identify Strengths and Performance Errors or Misconceptions"]
[null,null,"Identify the prioritized need for each group of students by placing a 1 in the column next to that need."]
[]
[null,null,null,null,{"$f":"\"Students \" &Cover!K13 & \" or Higher\"","v":"Students PROFICIENT or Higher"}]
[null,null,null,null,"Next Steps",null,null,null,null,null,null,null,"Inference"]
[null,null,null,null,null,null,null,null,null,null,null,null,null,null,null,null,null,null,null,null,null,{"$f":"SUM(E38:E45)","v":0}]
[]
[]
[]
[]
[]
[]
[]
[]
[null,null,null,null,{"$f":"\"Students \" &Cover!K14","v":"Students CLOSE TO"}]
[null,null,null,null,"Performance Errors and/or Misconceptions",null,null,null,null,null,null,null,"Inference"]
[null,null,null,null,null,null,null,null,null,null,null,null,null,null,null,null,null,null,null,null,null,{"$f":"SUM(E49:E56)","v":0}]
[]
[]
[]
[]
[]
[]
[]
[]
[null,null,null,null,{"$f":"\"Students \" &Cover!K15","v":"Students PROGRESSING"}]
[null,null,null,null,"Performance Errors and/or Misconceptions",null,null,null,null,null,null,null,"Inference"]
[null,null,null,null,null,null,null,null,null,null,null,null,null,null,null,null,null,null,null,null,null,{"$f":"SUM(E60:E67)","v":0}]
[]
[]
[]
[]
[]
[]
[]
[]
[null,null,null,null,{"$f":"\"Students \" &Cover!K16","v":"Students NEEDS PRACTICE"}]
[null,null,null,null,"Performance Errors and/or Misconceptions",null,null,null,null,null,null,null,"Inference"]
[null,null,null,null,null,null,null,null,null,null,null,null,null,null,null,null,null,null,null,null,null,{"$f":"SUM(E71:E78)","v":0}]
[]
[]
[]
[]
[]
[]
[]
[]
[null,"Step 3: SMART Goal Statement"]
[null,null,null,null,null,null,null,null,null,null,null,{"$f":"ROUND(MID(E84*100,1,5),1)&\"%\"","v":"0%"},{"$f":"ROUND(MID(N84*100,1,5),0)&\"%\"","v":"0%"}]
[null,null,null,"Group:",null,null,null,"Topic:",null,null,null,"End of Unit Date:",null,null,null,null,"Assessment Tool:"]
[]
[null,null,null,"Current Proficiency:",{"$f":"J31","v":0},null,"Projected Goal:",{"$f":"J31+M31+O31","v":0},null,"Adjustment:",null,null,"Modified Goal:",{"$f":"H84+K84","v":0},null,null,"Assessment Date:"]
[]
[]
[]
[null,null,null,{"$f":"\"The percentage of \"&E82&\" students proficient or higher in \"&I82&\" will increase from \"&L81&\" to \"&M81&\" by \"&M82&\" as measured by a(n) \"&R82&\" given on \"&R84&\".\"","v":"The percentage of  students proficient or higher in  will increase from 0% to 0% by  as measured by a(n)  given on ."}]
[]
[]
[]
[null,"Step 4: Select Instructional Strategies",null,null,null,null,null,null,"Review the list below and record selected strategies in the chart."]
[null,null,"Possible Strategies to Consider:"]
[null,null,"Compare",null,"Classify",null,"Create Metaphors",null,"Create Analogies",null,"Non-Linguistic Representations/Visual Tools",null,null,null,null,null,"Writing"]
[null,null,"Reinforce Effort*",null,"Provide Recognition",null,"Homework*",null,"Practice*",null,"Note-Taking",null,null,"Advanced Organizers",null,null,"Provide Feedback*"]
[null,null,null,null,null,null,null,null,"Generate/Test Hypotheses","Cue","Question","Summarize",null,"Set Objectives*",null,null,"Cooperative Learning"]
[null,null," * = Strategies recommended for daily use"]
[]
[]
[null,null,null,{"$f":"E36","v":"Students PROFICIENT or Higher"}]
[null,null,null,"Identified Need:",null,{"$f":"IF(V38=0,\"\",VLOOKUP(1,E38:L45,2,FALSE))","v":""},null,null,null,null,null,null,"Inference:",{"$f":"IF(V38=0,\"\",IF(VLOOKUP(1,E38:T46,9,FALSE)=\"\",\"\",(VLOOKUP(1,E38:T46,9,FALSE))))","v":""}]
[null,null,null,"Selected Instructional Strategy",null,null,null,null,"Learning Environment",null,null,"Time - Duration of the Teaching of Specific Concepts and Skills",null,"Materials for Teachers and Students",null,null,"Assignments, Assessments - Where will students be required to use the strategy?"]
[]
[]
[null,null,null,{"$f":"E47","v":"Students CLOSE TO"}]
[null,null,null,"Identified Need:",null,{"$f":"IF(V49=0,\"\",VLOOKUP(1,E49:F56,2,FALSE))","v":""},null,null,null,null,null,null,"Inference:",{"$f":"IF(V49=0,\"\",IF(VLOOKUP(1,E49:T57,9,FALSE)=\"\",\"\",(VLOOKUP(1,E49:T57,9,FALSE))))","v":""}]
[null,null,null,"Selected Instructional Strategy",null,null,null,null,"Learning Environment",null,null,"Time - Duration of the Teaching of Specific Concepts and Skills",null,"Materials for Teachers and Students",null,null,"Assignments, Assessments - Where will students be required to use the strategy?"]
[]
[]
[null,null,null,{"$f":"E58","v":"Students PROGRESSING"}]
[null,null,null,"Identified Need:",null,{"$f":"IF(V60=0,\"\",VLOOKUP(1,E60:F68,2,FALSE))","v":""},null,null,null,null,null,null,"Inference:",{"$f":"IF(V60=0,\"\",IF(VLOOKUP(1,E60:T68,9,FALSE)=\"\",\"\",(VLOOKUP(1,E60:T68,9,FALSE))))","v":""}]
[null,null,null,"Selected Instructional Strategy",null,null,null,null,"Learning Environment",null,null,"Time - Duration of the Teaching of Specific Concepts and Skills",null,"Materials for Teachers and Students",null,null,"Assignments, Assessments - Where will students be required to use the strategy?"]
[]
[]
[null,null,null,{"$f":"E69","v":"Students NEEDS PRACTICE"}]
[null,null,null,"Identified Need:",null,{"$f":"IF(V71=0,\"\",VLOOKUP(1,E71:L78,2,FALSE))","v":""},null,null,null,null,null,null,"Inference:",{"$f":"IF(V71=0,\"\",IF(VLOOKUP(1,E71:T78,9,FALSE)=\"\",\"\",(VLOOKUP(1,E71:T78,9,FALSE))))","v":""}]
[null,null,null,"Selected Instructional Strategy",null,null,null,null,"Learning Environment",null,null,"Time - Duration of the Teaching of Specific Concepts and Skills",null,"Materials for Teachers and Students",null,null,"Assignments, Assessments - Where will students be required to use the strategy?"]
[]
[]
[null,"Step 5: Results Indicators"]
[null,null,"Describe explicit behaviors (both student and adult) we expect to see as a result of implementing the instructional strategies plan. How will you know that the strategies are working? Look-fors and evidence of learning?  What are proficient students able to do successfully?"]
[]
[null,null,null,{"$f":"E36","v":"Students PROFICIENT or Higher"}]
[null,null,null,"Identified Need:",null,{"$f":"IF(F101=\"\",\"\",F101)","v":""},null,null,null,null,null,null,"Inference:",{"$f":"IF(N101=\"\",\"\",N101)","v":""}]
[null,null,null,"Selected Strategy:",null,{"$f":"IF(D103=\"\",\"\",D103)","v":""}]
[null,null,null,"Results Indicators:","Adult Behaviors:"]
[null,null,null,null,"Student Behaviors:"]
[null,null,null,null,"Look-fors in Student Work:"]
[]
[null,null,null,{"$f":"E47","v":"Students CLOSE TO"}]
[null,null,null,"Identified Need:",null,{"$f":"F106","v":""},null,null,null,null,null,null,"Inference:",{"$f":"IF(N106=\"\",\"\",N106)","v":""}]
[null,null,null,"Selected Strategy:",null,{"$f":"IF(D108=\"\",\"\",D108)","v":""}]
[null,null,null,"Results Indicators:","Adult Behaviors:"]
[null,null,null,null,"Student Behaviors:"]
[null,null,null,null,"Look-fors in Student Work:"]
[]
[null,null,null,{"$f":"E58","v":"Students PROGRESSING"}]
[null,null,null,"Identified Need:",null,{"$f":"F111","v":""},null,null,null,null,null,null,"Inference:",{"$f":"IF(N111=\"\",\"\",N111)","v":""}]
[null,null,null,"Selected Strategy:",null,{"$f":"IF(D113=\"\",\"\",D113)","v":""}]
[null,null,null,"Results Indicators:","Adult Behaviors:"]
[null,null,null,null,"Student Behaviors:"]
[null,null,null,null,"Look-fors in Student Work:"]
[]
[null,null,null,{"$f":"E69","v":"Students NEEDS PRACTICE"}]
[null,null,null,"Identified Need:",null,{"$f":"F116","v":""},null,null,null,null,null,null,"Inference:",{"$f":"IF(N116=\"\",\"\",N116)","v":""}]
[null,null,null,"Selected Strategy:",null,{"$f":"IF(D118=\"\",\"\",D118)","v":""}]
[null,null,null,"Results Indicators:","Adult Behaviors:"]
[null,null,null,null,"Student Behaviors:"]
[null,null,null,null,"Look-fors in Student Work:"]
[]
[]
[null,null,null,"Notes:"]

{"sheet":"Minutes 4","index":4,"n_rows":152,"n_cols":22,"rows_kept":152,"cut":false,"hidden":false,"merged":[[146,3,148,3],[146,4,146,6],[146,7,146,19],[147,4,147,6],[147,7,147,19],[148,4,148,6],[148,7,148,19],[143,3,143,19],[144,3,144,4],[144,5,144,11],[144,13,144,19],[145,3,145,4],[145,5,145,19],[139,3,141,3],[139,4,139,6],[139,7,139,19],[140,4,140,6],[140,7,140,19],[141,4,141,6],[141,7,141,19],[136,3,136,19],[137,3,137,4],[137,5,137,11],[137,13,137,19],[138,3,138,4],[138,5,138,19],[132,3,134,3],[132,4,132,6],[132,7,132,19],[133,4,133,6],[133,7,133,19],[134,4,134,6],[134,7,134,19],[129,3,129,19],[130,3,130,4],[130,5,130,11],[130,13,130,19],[131,3,131,4],[131,5,131,19],[125,3,127,3],[125,4,125,6],[125,7,125,19],[126,4,126,6],[126,7,126,19],[127,4,127,6],[127,7,127,19],[122,3,122,19],[123,3,123,4],[123,5,123,11],[123,13,123,19],[124,3,124,4],[124,5,124,19],[117,3,117,7],[117,8,117,10],[117,11,117,12],[117,13,117,15],[117,16,117,19],[120,2,120,19],[115,5,115,11],[115,13,115,19],[116,3,116,7],[116,8,116,10],[116,11,116,12],[116,13,116,15],[116,16,116,19],[112,3,112,7],[112,8,112,10],[112,11,112,12],[112,13,112,15],[112,16,112,19],[114,3,114,19],[110,5,110,11],[110,13,110,19],[111,3,111,7],[111,8,111,10],[111,11,111,12],[111,13,111,15],[111,16,111,19],[107,3,107,7],[107,8,107,10],[107,11,107,12],[107,13,107,15],[107,16,107,19],[109,3,109,19],[105,5,105,11],[105,13,105,19],[106,3,106,7],[106,8,106,10],[106,11,106,12],[106,13,106,15],[106,16,106,19],[102,3,102,7],[102,8,102,10],[102,11,102,12],[102,13,102,15],[102,16,102,19],[104,3,104,19],[99,3,99,19],[100,5,100,11],[100,13,100,19],[100,21,100,23],[101,3,101,7],[101,8,101,10],[101,11,101,12],[101,13,101,15],[101,16,101,19],[81,4,81,5],[81,8,81,9],[81,12,81,13],[81,17,81,18],[83,17,83,18],[87,3,87,19],[75,5,75,11],[75,12,75,19],[76,5,76,11],[76,12,76,19],[77,5,77,11],[77,12,77,19],[72,5,72,11],[72,12,72,19],[73,5,73,11],[73,12,73,19],[74,5,74,11],[74,12,74,19],[69,4,69,11],[69,12,69,19],[70,5,70,11],[70,12,70,19],[71,5,71,11],[71,12,71,19],[68,4,68,19],[64,5,64,11],[64,12,64,19],[65,5,65,11],[65,12,65,19],[66,5,66,11],[66,12,66,19],[61,5,61,11],[61,12,61,19],[62,5,62,11],[62,12,62,19],[63,5,63,11],[63,12,63,19],[58,4,58,11],[58,12,58,19],[59,5,59,11],[59,12,59,19],[60,5,60,11],[60,12,60,19],[57,4,57,19],[53,5,53,11],[53,12,53,19],[54,5,54,11],[54,12,54,19],[55,5,55,11],[55,12,55,19],[50,5,50,11],[50,12,50,19],[51,5,51,11],[51,12,51,19],[52,5,52,11],[52,12,52,19],[47,4,47,11],[47,12,47,19],[48,5,48,11],[48,12,48,19],[49,5,49,11],[49,12,49,19],[46,4,46,19],[42,5,42,11],[42,12,42,19],[43,5,43,11],[43,12,43,19],[44,5,44,11],[44,12,44,19],[39,5,39,11],[39,12,39,19],[40,5,40,11],[40,12,40,19],[41,5,41,11],[41,12,41,19],[36,4,36,11],[36,12,36,19],[37,5,37,11],[37,12,37,19],[38,5,38,11],[38,12,38,19],[35,4,35,19],[1,8,1,10],[1,15,1,17],[21,5,21,6],[22,5,22,6],[23,5,23,6],[24,5,24,6],[3,1,3,5],[4,1,4,2],[6,1,6,2],[7,1,7,2],[8,1,8,2],[10,1,10,4],[10,5,10,16],[11,1,11,10],[11,11,11,16],[12,1,12,9],[12,10,12,16],[13,1,13,9],[3,11,3,15],[4,11,4,12],[8,11,8,12],[6,11,6,12],[7,11,7,12],[25,5,25,6],[26,5,26,6],[27,5,27,6],[28,5,28,6],[29,5,29,6],[30,5,30,6],[13,10,13,16],[14,1,14,9],[14,10,14,16],[15,1,15,9],[15,10,15,16],[16,1,16,9],[16,10,16,16]]}
[]
[null,null,null,"Team:",{"$f":"IF(Cover!D3=0,\"\",Cover!D3)","v":""},null,null,"Assessment:",{"$f":"IF(Cover!J6=0,\"\",Cover!J6)","v":"CFA 4"},null,null,null,null,null,"Date of Meeting:"]
[null,null,null,"Team Members:",{"$f":"Cover!S22","v":""}]
[null,null,null,null,null,null,null,null,null,null,null,"Please place a X in row for rating."]
[null,null,null,null,null,null,null,null,null,null,null,"Norms",null,"Low ",null,null,"High"]
[null,null,null,null,null,null,null,null,null,null,null,"Meeting Rating",null,1,2,3,4]
[null,null,null,null,null,null,null,null,null,null,null,"Preparation"]
[null,null,null,null,null,null,null,null,null,null,null,"Respect"]
[null,null,null,null,null,null,null,null,null,null,null,"Time on Task"]
[null,null,null,null,null,null,null,null,null,null,null,"Active Participation"]
[null,"Priority Standard:"]
[null,"Skills (Verbs)    DOK = ",null,null,null,null,null,null,null,null,null,"Concepts (Nouns)"]
[]
[]
[]
[]
[]
[]
[]
[null,"Step 1: Collect and Chart Data"]
[]
[null,null,null,null,null,"Teacher",null,"# Students",{"$f":" \"# \" & Cover!$K13 & \" and Higher\"","v":"# PROFICIENT and Higher"},{"$f":" \"% \" & Cover!$K13 & \" and Higher\"","v":"% PROFICIENT and Higher"},"Change",{"$f":" \"# \" & Cover!$K14","v":"# CLOSE TO"},{"$f":" \"% \" & Cover!$K14","v":"% CLOSE TO"},{"$f":" \"# \" & Cover!$K15","v":"# PROGRESSING"},{"$f":" \"% \" & Cover!$K15","v":"% PROGRESSING"},{"$f":" \"# \" & Cover!$K16","v":"# NEEDS PRACTICE"},{"$f":" \"% \" & Cover!$K16","v":"% NEEDS PRACTICE"}]
[null,null,null,null,null,{"$f":"Cover!D4","v":0},null,{"$f":"Tchr1!$H$4","v":0},{"$f":"Tchr1!$H$5","v":0},{"$f":"IF(H23=0,0,(I23/H23))","v":0},{"$f":"J23-'Minutes 1'!J23","v":0},{"$f":"Tchr1!$H$7","v":0},{"$f":"IF(L23=0,0,(L23/H23))","v":0},{"$f":"Tchr1!$H$9","v":0},{"$f":"IF(N23=0,0,(N23/H23))","v":0},{"$f":"Tchr1!$H$11","v":0},{"$f":"IF(P23=0,0,(P23/H23))","v":0}]
[null,null,null,null,null,{"$f":"Cover!D5","v":0},null,{"$f":"Tchr2!$H$4","v":0},{"$f":"Tchr2!$H$5","v":0},{"$f":"IF(H24=0,0,(I24/H24))","v":0},{"$f":"J24-'Minutes 1'!J24","v":0},{"$f":"Tchr2!$H$7","v":0},0,{"$f":"Tchr2!$H$9","v":0},0,{"$f":"Tchr2!$H$11","v":0},0]
[null,null,null,null,null,{"$f":"Cover!D6","v":0},null,{"$f":"Tchr3!$H$4","v":0},{"$f":"Tchr3!$H$5","v":0},0,{"$f":"J25-'Minutes 1'!J25","v":0},{"$f":"Tchr3!$H$7","v":0},0,{"$f":"Tchr3!$H$9","v":0},0,{"$f":"Tchr3!$H$11","v":0},0]
[null,null,null,null,null,{"$f":"Cover!D7","v":0},null,{"$f":"Tchr4!$H$4","v":0},{"$f":"Tchr4!$H$5","v":0},0,{"$f":"J26-'Minutes 1'!J26","v":0},{"$f":"Tchr4!$H$7","v":0},0,{"$f":"Tchr4!$H$9","v":0},0,{"$f":"Tchr4!$H$11","v":0},0]
[null,null,null,null,null,{"$f":"Cover!D8","v":0},null,{"$f":"Tchr5!$H$4","v":0},{"$f":"Tchr5!$H$5","v":0},0,{"$f":"J27-'Minutes 1'!J27","v":0},{"$f":"Tchr5!$H$7","v":0},0,{"$f":"Tchr5!$H$9","v":0},0,{"$f":"Tchr5!$H$11","v":0},0]
[null,null,null,null,null,{"$f":"Cover!D9","v":0},null,{"$f":"Tchr6!$H$4","v":0},{"$f":"Tchr6!$H$5","v":0},0,{"$f":"J28-'Minutes 1'!J28","v":0},{"$f":"Tchr6!$H$7","v":0},0,{"$f":"Tchr6!$H$9","v":0},0,{"$f":"Tchr6!$H$11","v":0},0]
[null,null,null,null,null,{"$f":"Cover!D10","v":0},null,{"$f":"Tchr7!$H$4","v":0},{"$f":"Tchr7!$H$5","v":0},0,{"$f":"J29-'Minutes 1'!J29","v":0},{"$f":"Tchr7!$H$7","v":0},0,{"$f":"Tchr7!$H$9","v":0},0,{"$f":"Tchr7!$H$11","v":0},0]
[null,null,null,null,null,{"$f":"Cover!D11","v":0},null,{"$f":"Tchr8!$H$4","v":0},{"$f":"Tchr8!$H$5","v":0},0,{"$f":"J30-'Minutes 1'!J30","v":0},{"$f":"Tchr8!$H$7","v":0},0,{"$f":"Tchr8!$H$9","v":0},0,{"$f":"Tchr8!$H$11","v":0},0]
[null,null,null,null,null,"TEAM",null,{"$f":"SUM(H23:H28)","v":0},{"$f":"SUM(I23:I28)","v":0},{"$f":"IF(H31=0,0,(I31/H31))","v":0},{"$f":"J31-'Minutes 1'!J31","v":0},{"$f":"SUM(L23:L28)","v":0},0,{"$f":"SUM(N23:N28)","v":0},0,{"$f":"SUM(P23:P28)","v":0},0]
[]
[null,"Step 2: Analysis - Identify Strengths and Performance Errors or Misconceptions"]
[null,null,"Identify the prioritized need for each group of students by placing a 1 in the column next to that need."]
[]
[null,null,null,null,{"$f":"\"Students \" &Cover!K13 & \" or Higher\"","v":"Students PROFICIENT or Higher"}]
[null,null,null,null,"Next Steps",null,null,null,null,null,null,null,"Inference"]
[null,null,null,null,null,null,null,null,null,null,null,null,null,null,null,null,null,null,null,null,null,{"$f":"SUM(E38:E45)","v":0}]
[]
[]
[]
[]
[]
[]
[]
[]
[null,null,null,null,{"$f":"\"Students \" &Cover!K14","v":"Students CLOSE TO"}]
[null,null,null,null,"Performance Errors and/or Misconceptions",null,null,null,null,null,null,null,"Inference"]
[null,null,null,null,null,null,null,null,null,null,null,null,null,null,null,null,null,null,null,null,null,{"$f":"SUM(E49:E56)","v":0}]
[]
[]
[]
[]
[]
[]
[]
[]
[null,null,null,null,{"$f":"\"Students \" &Cover!K15","v":"Students PROGRESSING"}]
[null,null,null,null,"Performance Errors and/or Misconceptions",null,null,null,null,null,null,null,"Inference"]
[null,null,null,null,null,null,null,null,null,null,null,null,null,null,null,null,null,null,null,null,null,{"$f":"SUM(E60:E67)","v":0}]
[]
[]
[]
[]
[]
[]
[]
[]
[null,null,null,null,{"$f":"\"Students \" &Cover!K16","v":"Students NEEDS PRACTICE"}]
[null,null,null,null,"Performance Errors and/or Misconceptions",null,null,null,null,null,null,null,"Inference"]
[null,null,null,null,null,null,null,null,null,null,null,null,null,null,null,null,null,null,null,null,null,{"$f":"SUM(E71:E78)","v":0}]
[]
[]
[]
[]
[]
[]
[]
[]
[null,"Step 3: SMART Goal Statement"]
[null,null,null,null,null,null,null,null,null,null,null,{"$f":"ROUND(MID(E84*100,1,5),1)&\"%\"","v":"0%"},{"$f":"ROUND(MID(N84*100,1,5),0)&\"%\"","v":"0%"}]
[null,null,null,"Group:",null,null,null,"Topic:",null,null,null,"End of Unit Date:",null,null,null,null,"Assessment Tool:"]
[]
[null,null,null,"Current Proficiency:",{"$f":"J31","v":0},null,"Projected Goal:",{"$f":"J31+M31+O31","v":0},null,"Adjustment:",null,null,"Modified Goal:",{"$f":"H84+K84","v":0},null,null,"Assessment Date:"]
[]
[]
[]
[null,null,null,{"$f":"\"The percentage of \"&E82&\" students proficient or higher in \"&I82&\" will increase from \"&L81&\" to \"&M81&\" by \"&M82&\" as measured by a(n) \"&R82&\" given on \"&R84&\".\"","v":"The percentage of  students proficient or higher in  will increase from 0% to 0% by  as measured by a(n)  given on ."}]
[]
[]
[]
[null,"Step 4: Select Instructional Strategies",null,null,null,null,null,null,"Review the list below and record selected strategies in the chart."]
[null,null,"Possible Strategies to Consider:"]
[null,null,"Compare",null,"Classify",null,"Create Metaphors",null,"Create Analogies",null,"Non-Linguistic Representations/Visual Tools",null,null,null,null,null,"Writing"]
[null,null,"Reinforce Effort*",null,"Provide Recognition",null,"Homework*",null,"Practice*",null,"Note-Taking",null,null,"Advanced Organizers",null,null,"Provide Feedback*"]
[null,null,null,null,null,null,null,null,"Generate/Test Hypotheses","Cue","Question","Summarize",null,"Set Objectives*",null,null,"Cooperative Learning"]
[null,null," * = Strategies recommended for daily use"]
[]
[]
[null,null,null,{"$f":"E36","v":"Students PROFICIENT or Higher"}]
[null,null,null,"Identified Need:",null,{"$f":"IF(V38=0,\"\",VLOOKUP(1,E38:L45,2,FALSE))","v":""},null,null,null,null,null,null,"Inference:",{"$f":"IF(V38=0,\"\",IF(VLOOKUP(1,E38:T46,9,FALSE)=\"\",\"\",(VLOOKUP(1,E38:T46,9,FALSE))))","v":""}]
[null,null,null,"Selected Instructional Strategy",null,null,null,null,"Learning Environment",null,null,"Time - Duration of the Teaching of Specific Concepts and Skills",null,"Materials for Teachers and Students",null,null,"Assignments, Assessments - Where will students be required to use the strategy?"]
[]
[]
[null,null,null,{"$f":"E47","v":"Students CLOSE TO"}]
[null,null,null,"Identified Need:",null,{"$f":"IF(V49=0,\"\",VLOOKUP(1,E49:F56,2,FALSE))","v":""},null,null,null,null,null,null,"Inference:",{"$f":"IF(V49=0,\"\",IF(VLOOKUP(1,E49:T57,9,FALSE)=\"\",\"\",(VLOOKUP(1,E49:T57,9,FALSE))))","v":""}]
[null,null,null,"Selected Instructional Strategy",null,null,null,null,"Learning Environment",null,null,"Time - Duration of the Teaching of Specific Concepts and Skills",null,"Materials for Teachers and Students",null,null,"Assignments, Assessments - Where will students be required to use the strategy?"]
[]
[]
[null,null,null,{"$f":"E58","v":"Students PROGRESSING"}]
[null,null,null,"Identified Need:",null,{"$f":"IF(V60=0,\"\",VLOOKUP(1,E60:F68,2,FALSE))","v":""},null,null,null,null,null,null,"Inference:",{"$f":"IF(V60=0,\"\",IF(VLOOKUP(1,E60:T68,9,FALSE)=\"\",\"\",(VLOOKUP(1,E60:T68,9,FALSE))))","v":""}]
[null,null,null,"Selected Instructional Strategy",null,null,null,null,"Learning Environment",null,null,"Time - Duration of the Teaching of Specific Concepts and Skills",null,"Materials for Teachers and Students",null,null,"Assignments, Assessments - Where will students be required to use the strategy?"]
[]
[]
[null,null,null,{"$f":"E69","v":"Students NEEDS PRACTICE"}]
[null,null,null,"Identified Need:",null,{"$f":"IF(V71=0,\"\",VLOOKUP(1,E71:L78,2,FALSE))","v":""},null,null,null,null,null,null,"Inference:",{"$f":"IF(V71=0,\"\",IF(VLOOKUP(1,E71:T78,9,FALSE)=\"\",\"\",(VLOOKUP(1,E71:T78,9,FALSE))))","v":""}]
[null,null,null,"Selected Instructional Strategy",null,null,null,null,"Learning Environment",null,null,"Time - Duration of the Teaching of Specific Concepts and Skills",null,"Materials for Teachers and Students",null,null,"Assignments, Assessments - Where will students be required to use the strategy?"]
[]
[]
[null,"Step 5: Results Indicators"]
[null,null,"Describe explicit behaviors (both student and adult) we expect to see as a result of implementing the instructional strategies plan. How will you know that the strategies are working? Look-fors and evidence of learning?  What are proficient students able to do successfully?"]
[]
[null,null,null,{"$f":"E36","v":"Students PROFICIENT or Higher"}]
[null,null,null,"Identified Need:",null,{"$f":"IF(F101=\"\",\"\",F101)","v":""},null,null,null,null,null,null,"Inference:",{"$f":"IF(N101=\"\",\"\",N101)","v":""}]
[null,null,null,"Selected Strategy:",null,{"$f":"IF(D103=\"\",\"\",D103)","v":""}]
[null,null,null,"Results Indicators:","Adult Behaviors:"]
[null,null,null,null,"Student Behaviors:"]
[null,null,null,null,"Look-fors in Student Work:"]
[]
[null,null,null,{"$f":"E47","v":"Students CLOSE TO"}]
[null,null,null,"Identified Need:",null,{"$f":"F106","v":""},null,null,null,null,null,null,"Inference:",{"$f":"IF(N106=\"\",\"\",N106)","v":""}]
[null,null,null,"Selected Strategy:",null,{"$f":"IF(D108=\"\",\"\",D108)","v":""}]
[null,null,null,"Results Indicators:","Adult Behaviors:"]
[null,null,null,null,"Student Behaviors:"]
[null,null,null,null,"Look-fors in Student Work:"]
[]
[null,null,null,{"$f":"E58","v":"Students PROGRESSING"}]
[null,null,null,"Identified Need:",null,{"$f":"F111","v":""},null,null,null,null,null,null,"Inference:",{"$f":"IF(N111=\"\",\"\",N111)","v":""}]
[null,null,null,"Selected Strategy:",null,{"$f":"IF(D113=\"\",\"\",D113)","v":""}]
[null,null,null,"Results Indicators:","Adult Behaviors:"]
[null,null,null,null,"Student Behaviors:"]
[null,null,null,null,"Look-fors in Student Work:"]
[]
[null,null,null,{"$f":"E69","v":"Students NEEDS PRACTICE"}]
[null,null,null,"Identified Need:",null,{"$f":"F116","v":""},null,null,null,null,null,null,"Inference:",{"$f":"IF(N116=\"\",\"\",N116)","v":""}]
[null,null,null,"Selected Strategy:",null,{"$f":"IF(D118=\"\",\"\",D118)","v":""}]
[null,null,null,"Results Indicators:","Adult Behaviors:"]
[null,null,null,null,"Student Behaviors:"]
[null,null,null,null,"Look-fors in Student Work:"]
[]
[]
[null,null,null,"Notes:"]

{"sheet":"Graphs","index":5,"n_rows":121,"n_cols":18,"rows_kept":121,"cut":false,"hidden":false,"merged":[]}
[]
[]
[]
[]
[null,{"$f":"Cover!D3&\" \" & 'Minutes 1'!I2&\" \"&Cover!L3","v":" CFA 1 Pre "}]
[null,"Teacher",{"$f":"Cover!Q13","v":"% PROFICIENT or higher"},{"$f":"Cover!Q14","v":"% CLOSE TO"},{"$f":"Cover!Q15","v":"% PROGRESSING"},{"$f":"Cover!Q16","v":"% NEEDS PRACTICE"}]
[null,{"$f":"'Minutes 1'!F23","v":0},{"$f":"'Minutes 1'!J23","v":0},{"$f":"'Minutes 1'!L23","v":0},{"$f":"'Minutes 1'!N23","v":0},{"$f":"'Minutes 1'!P23","v":0}]
[null,{"$f":"'Minutes 1'!F24","v":0},{"$f":"'Minutes 1'!J24","v":0},{"$f":"'Minutes 1'!L24","v":0},{"$f":"'Minutes 1'!N24","v":0},{"$f":"'Minutes 1'!P24","v":0}]
[null,{"$f":"'Minutes 1'!F25","v":0},{"$f":"'Minutes 1'!J25","v":0},{"$f":"'Minutes 1'!L25","v":0},{"$f":"'Minutes 1'!N25","v":0},{"$f":"'Minutes 1'!P25","v":0}]
[null,{"$f":"'Minutes 1'!F26","v":0},{"$f":"'Minutes 1'!J26","v":0},{"$f":"'Minutes 1'!L26","v":0},{"$f":"'Minutes 1'!N26","v":0},{"$f":"'Minutes 1'!P26","v":0}]
[null,{"$f":"'Minutes 1'!F27","v":0},{"$f":"'Minutes 1'!J27","v":0},{"$f":"'Minutes 1'!L27","v":0},{"$f":"'Minutes 1'!N27","v":0},{"$f":"'Minutes 1'!P27","v":0}]
[null,{"$f":"'Minutes 1'!F28","v":0},{"$f":"'Minutes 1'!J28","v":0},{"$f":"'Minutes 1'!L28","v":0},{"$f":"'Minutes 1'!N28","v":0},{"$f":"'Minutes 1'!P28","v":0}]
[null,{"$f":"'Minutes 1'!F29","v":0},{"$f":"'Minutes 1'!J29","v":0},{"$f":"'Minutes 1'!L29","v":0},{"$f":"'Minutes 1'!N29","v":0},{"$f":"'Minutes 1'!P29","v":0}]
[null,{"$f":"'Minutes 1'!F30","v":0},{"$f":"'Minutes 1'!J30","v":0},{"$f":"'Minutes 1'!L30","v":0},{"$f":"'Minutes 1'!N30","v":0},{"$f":"'Minutes 1'!P30","v":0}]
[null,{"$f":"'Minutes 1'!F31","v":"TEAM"},{"$f":"'Minutes 1'!J31","v":0},{"$f":"'Minutes 1'!L31","v":0},{"$f":"'Minutes 1'!N31","v":0},{"$f":"'Minutes 1'!P31","v":0}]
[]
[null,null,{"$f":"C$6","v":"% PROFICIENT or higher"},{"$f":"D$6","v":"% CLOSE TO"},"% PROGRESSING","% NEEDS PRACTICE"]
[null,{"$f":"B15","v":"TEAM"},{"$f":"C15","v":0},{"$f":"D15","v":0},{"$f":"E15","v":0},{"$f":"F15","v":0}]
[]
[null,{"$f":"Cover!D3&\" \"&Cover!J4&\" \"&Cover!L4","v":" CFA 2 Mid "}]
[null,"Teacher",{"$f":"C$6","v":"% PROFICIENT or higher"},{"$f":"D$6","v":"% CLOSE TO"},"% PROGRESSING","% NEEDS PRACTICE"]
[null,{"$f":"'Minutes 2'!F23","v":0},{"$f":"'Minutes 2'!J23","v":0},{"$f":"'Minutes 2'!M23","v":0},{"$f":"'Minutes 2'!O23","v":0},{"$f":"'Minutes 2'!Q23","v":0}]
[null,{"$f":"'Minutes 2'!F24","v":0},{"$f":"'Minutes 2'!J24","v":0},{"$f":"'Minutes 2'!M24","v":0},{"$f":"'Minutes 2'!O24","v":0},{"$f":"'Minutes 2'!Q24","v":0}]
[null,{"$f":"'Minutes 2'!F25","v":0},{"$f":"'Minutes 2'!J25","v":0},{"$f":"'Minutes 2'!M25","v":0},{"$f":"'Minutes 2'!O25","v":0},{"$f":"'Minutes 2'!Q25","v":0}]
[null,{"$f":"'Minutes 2'!F26","v":0},{"$f":"'Minutes 2'!J26","v":0},{"$f":"'Minutes 2'!M26","v":0},{"$f":"'Minutes 2'!O26","v":0},{"$f":"'Minutes 2'!Q26","v":0}]
[null,{"$f":"'Minutes 2'!F27","v":0},{"$f":"'Minutes 2'!J27","v":0},{"$f":"'Minutes 2'!M27","v":0},{"$f":"'Minutes 2'!O27","v":0},{"$f":"'Minutes 2'!Q27","v":0}]
[null,{"$f":"'Minutes 2'!F28","v":0},{"$f":"'Minutes 2'!J28","v":0},{"$f":"'Minutes 2'!M28","v":0},{"$f":"'Minutes 2'!O28","v":0},{"$f":"'Minutes 2'!Q28","v":0}]
[null,{"$f":"'Minutes 2'!F29","v":0},{"$f":"'Minutes 2'!J29","v":0},{"$f":"'Minutes 2'!M29","v":0},{"$f":"'Minutes 2'!O29","v":0},{"$f":"'Minutes 2'!Q29","v":0}]
[null,{"$f":"'Minutes 2'!F30","v":0},{"$f":"'Minutes 2'!J30","v":0},{"$f":"'Minutes 2'!M30","v":0},{"$f":"'Minutes 2'!O30","v":0},{"$f":"'Minutes 2'!Q30","v":0}]
[null,{"$f":"'Minutes 2'!F31","v":"TEAM"},{"$f":"'Minutes 2'!J31","v":0},{"$f":"'Minutes 2'!M31","v":0},{"$f":"'Minutes 2'!O31","v":0},{"$f":"'Minutes 2'!Q31","v":0}]
[]
[null,null,{"$f":"C$6","v":"% PROFICIENT or higher"},{"$f":"D$6","v":"% CLOSE TO"},"% PROGRESSING","% NEEDS PRACTICE"]
[null,{"$f":"B30","v":"TEAM"},{"$f":"C30","v":0},{"$f":"D30","v":0},{"$f":"E30","v":0},{"$f":"F30","v":0}]
[]
[null,null,{"$f":"Cover!D3&\" \"&Cover!J4","v":" CFA 2 Mid"}]
[null,null,{"$f":"C32 & \" Data set 1\"","v":"% PROFICIENT or higher Data set 1"},{"$f":"C32 & \" Data set 2\"","v":"% PROFICIENT or higher Data set 2"},{"$f":"D32 & \"       Data set 1\"","v":"% CLOSE TO       Data set 1"},{"$f":"D32 & \"             Data set 2\"","v":"% CLOSE TO             Data set 2"},{"$f":"E32 & \"           Data set 1\"","v":"% PROGRESSING           Data set 1"},{"$f":"E32 & \"        Data set 2\"","v":"% PROGRESSING        Data set 2"},{"$f":"F32 & \"       Data set 1\"","v":"% NEEDS PRACTICE       Data set 1"},{"$f":"F32 & \"             Data set 2\"","v":"% NEEDS PRACTICE             Data set 2"}]
[null,{"$f":"B22","v":0},{"$f":"C7","v":0},{"$f":"C22","v":0},{"$f":"D7","v":0},{"$f":"D22","v":0},{"$f":"E7","v":0},{"$f":"E22","v":0},{"$f":"F7","v":0},{"$f":"F22","v":0}]
[null,{"$f":"B23","v":0},0,{"$f":"C23","v":0},{"$f":"D8","v":0},0,0,0,0,0]
[null,0,0,{"$f":"C24","v":0},{"$f":"D9","v":0},0,0,0,0,0]
[null,0,0,{"$f":"C25","v":0},{"$f":"D10","v":0},0,0,0,0,0]
[null,0,0,{"$f":"C26","v":0},{"$f":"D11","v":0},0,0,0,0,0]
[null,0,0,{"$f":"C27","v":0},{"$f":"D12","v":0},0,0,0,0,0]
[null,{"$f":"B28","v":0},{"$f":"C13","v":0},{"$f":"C28","v":0},{"$f":"D13","v":0},{"$f":"D28","v":0},{"$f":"E13","v":0},{"$f":"E28","v":0},{"$f":"F13","v":0},{"$f":"F28","v":0}]
[null,0,0,0,0,0,0,0,0,0]
[null,{"$f":"B30","v":"TEAM"},{"$f":"C15","v":0},{"$f":"C30","v":0},{"$f":"D15","v":0},{"$f":"D30","v":0},{"$f":"E15","v":0},{"$f":"E30","v":0},{"$f":"F15","v":0},{"$f":"F30","v":0}]
[]
[]
[null,null,{"$f":"C$6","v":"% PROFICIENT or higher"},{"$f":"D$6","v":"% CLOSE TO"},"% PROGRESSING","% NEEDS PRACTICE"]
[null,"data set 1",{"$f":"C18","v":0},{"$f":"D18","v":0},{"$f":"E18","v":0},{"$f":"F18","v":0}]
[null,"data set 2",{"$f":"C30","v":0},{"$f":"D30","v":0},{"$f":"E30","v":0},{"$f":"F30","v":0}]
[]
[]
[]
[null,{"$f":"Cover!D3&\" \"&Cover!J5&\" \"&Cover!L5","v":" CFA 3 Post "}]
[null,"Teacher",{"$f":"C$6","v":"% PROFICIENT or higher"},{"$f":"D$6","v":"% CLOSE TO"},"% PROGRESSING","% NEEDS PRACTICE"]
[null,{"$f":"'Minutes 3'!F23","v":0},{"$f":"'Minutes 3'!J23","v":0},{"$f":"'Minutes 3'!M23","v":0},{"$f":"'Minutes 3'!O23","v":0},{"$f":"'Minutes 3'!Q23","v":0}]
[null,{"$f":"'Minutes 3'!F24","v":0},{"$f":"'Minutes 3'!J24","v":0},{"$f":"'Minutes 3'!M24","v":0},{"$f":"'Minutes 3'!O24","v":0},{"$f":"'Minutes 3'!Q24","v":0}]
[null,{"$f":"'Minutes 3'!F25","v":0},{"$f":"'Minutes 3'!J25","v":0},{"$f":"'Minutes 3'!M25","v":0},{"$f":"'Minutes 3'!O25","v":0},{"$f":"'Minutes 3'!Q25","v":0}]
[null,{"$f":"'Minutes 3'!F26","v":0},{"$f":"'Minutes 3'!J26","v":0},{"$f":"'Minutes 3'!M26","v":0},{"$f":"'Minutes 3'!O26","v":0},{"$f":"'Minutes 3'!Q26","v":0}]
[null,{"$f":"'Minutes 3'!F27","v":0},{"$f":"'Minutes 3'!J27","v":0},{"$f":"'Minutes 3'!M27","v":0},{"$f":"'Minutes 3'!O27","v":0},{"$f":"'Minutes 3'!Q27","v":0}]
[null,{"$f":"'Minutes 3'!F28","v":0},{"$f":"'Minutes 3'!J28","v":0},{"$f":"'Minutes 3'!M28","v":0},{"$f":"'Minutes 3'!O28","v":0},{"$f":"'Minutes 3'!Q28","v":0}]
[null,{"$f":"'Minutes 3'!F29","v":0},{"$f":"'Minutes 3'!J29","v":0},{"$f":"'Minutes 3'!M29","v":0},{"$f":"'Minutes 3'!O29","v":0},{"$f":"'Minutes 3'!Q29","v":0}]
[null,{"$f":"'Minutes 3'!F30","v":0},{"$f":"'Minutes 3'!J30","v":0},{"$f":"'Minutes 3'!M30","v":0},{"$f":"'Minutes 3'!O30","v":0},{"$f":"'Minutes 3'!Q30","v":0}]
[null,{"$f":"'Minutes 3'!F31","v":"TEAM"},{"$f":"'Minutes 3'!J31","v":0},{"$f":"'Minutes 3'!M31","v":0},{"$f":"'Minutes 3'!O31","v":0},{"$f":"'Minutes 3'!Q31","v":0}]
[]
[null,null,{"$f":"C$6","v":"% PROFICIENT or higher"},{"$f":"D$6","v":"% CLOSE TO"},"% PROGRESSING","% NEEDS PRACTICE"]
[null,{"$f":"B64","v":"TEAM"},{"$f":"C64","v":0},{"$f":"D64","v":0},{"$f":"E64","v":0},{"$f":"F64","v":0}]
[]
[null,null,{"$f":"Cover!D3&\" \"&Cover!J5","v":" CFA 3 Post"}]
[null,null,{"$f":"C66 & \" Data set 1\"","v":"% PROFICIENT or higher Data set 1"},{"$f":"C66 & \" Data set 2\"","v":"% PROFICIENT or higher Data set 2"},{"$f":"C66 & \"        Data set 3\"","v":"% PROFICIENT or higher        Data set 3"},{"$f":"D66 & \"         Data set 1\"","v":"% CLOSE TO         Data set 1"},{"$f":"D66 & \"             Data set 2\"","v":"% CLOSE TO             Data set 2"},{"$f":"D66 & \"             Data set 3\"","v":"% CLOSE TO             Data set 3"},{"$f":"E66 & \"           Data set 1\"","v":"% PROGRESSING           Data set 1"},{"$f":"E66 & \"               Data set 2\"","v":"% PROGRESSING               Data set 2"},{"$f":"E66 & \"               Data set 3\"","v":"% PROGRESSING               Data set 3"},{"$f":"F66 & \"       Data set 1\"","v":"% NEEDS PRACTICE       Data set 1"},{"$f":"F66 & \"             Data set 2\"","v":"% NEEDS PRACTICE             Data set 2"},{"$f":"F66 & \" Data set 3\"","v":"% NEEDS PRACTICE Data set 3"}]
[null,{"$f":"B56","v":0},{"$f":"C7","v":0},{"$f":"C22","v":0},{"$f":"C56","v":0},{"$f":"D7","v":0},{"$f":"D22","v":0},{"$f":"D56","v":0},{"$f":"E7","v":0},{"$f":"E22","v":0},{"$f":"E56","v":0},{"$f":"F7","v":0},{"$f":"F22","v":0},{"$f":"F56","v":0}]
[null,0,{"$f":"C8","v":0},{"$f":"C23","v":0},{"$f":"C57","v":0},{"$f":"D8","v":0},{"$f":"D23","v":0},{"$f":"D57","v":0},{"$f":"E8","v":0},{"$f":"E23","v":0},{"$f":"E57","v":0},{"$f":"F8","v":0},{"$f":"F23","v":0},{"$f":"F57","v":0}]
[null,0,0,0,0,0,0,0,0,0,0,0,0,0]
[null,0,0,0,0,0,0,0,0,0,0,0,0,0]
[null,0,0,0,0,0,0,0,0,0,0,0,0,0]
[null,0,0,0,0,0,0,0,0,0,0,0,0,0]
[null,0,0,0,0,0,0,0,0,0,0,0,0,0]
[null,0,0,0,0,0,0,0,0,0,0,0,0,0]
[null,"TEAM",{"$f":"C49","v":0},0,0,0,0,0,0,0,0,0,0,0]
[]
[]
[null,null,{"$f":"C$6","v":"% PROFICIENT or higher"},{"$f":"D$6","v":"% CLOSE TO"},"% PROGRESSING","% NEEDS PRACTICE"]
[null,"data set 1",{"$f":"C79","v":0},{"$f":"F79","v":0},{"$f":"I79","v":0},{"$f":"L79","v":0}]
[null,"data set 2",{"$f":"D79","v":0},{"$f":"G79","v":0},{"$f":"J79","v":0},{"$f":"M79","v":0}]
[null,"data set 3",{"$f":"E79","v":0},{"$f":"H79","v":0},{"$f":"K79","v":0},{"$f":"N79","v":0}]
[]
[]
[]
[null,{"$f":"Cover!D3&\" \"&Cover!J6&\" \"&Cover!L6","v":" CFA 4 "}]
[null,"Teacher","% PROFICIENT or higher","% CLOSE TO","% PROGRESSING","% NEEDS PRACTICE"]
[null,"a",{"$f":"'Minutes 4'!J23","v":0},{"$f":"'Minutes 4'!M23","v":0},{"$f":"'Minutes 4'!O23","v":0},{"$f":"'Minutes 4'!Q23","v":0}]
[null,"b",{"$f":"'Minutes 4'!J24","v":0},{"$f":"'Minutes 4'!M24","v":0},{"$f":"'Minutes 4'!O24","v":0},{"$f":"'Minutes 4'!Q24","v":0}]
[null,"c",{"$f":"'Minutes 4'!J25","v":0},{"$f":"'Minutes 4'!M25","v":0},{"$f":"'Minutes 4'!O25","v":0},{"$f":"'Minutes 4'!Q25","v":0}]
[null,"d",{"$f":"'Minutes 4'!J26","v":0},{"$f":"'Minutes 4'!M26","v":0},{"$f":"'Minutes 4'!O26","v":0},{"$f":"'Minutes 4'!Q26","v":0}]
[null,"e",{"$f":"'Minutes 4'!J27","v":0},{"$f":"'Minutes 4'!M27","v":0},{"$f":"'Minutes 4'!O27","v":0},{"$f":"'Minutes 4'!Q27","v":0}]
[null,"f",{"$f":"'Minutes 4'!J28","v":0},{"$f":"'Minutes 4'!M28","v":0},{"$f":"'Minutes 4'!O28","v":0},{"$f":"'Minutes 4'!Q28","v":0}]
[null,"g",{"$f":"'Minutes 4'!J29","v":0},{"$f":"'Minutes 4'!M29","v":0},{"$f":"'Minutes 4'!O29","v":0},{"$f":"'Minutes 4'!Q29","v":0}]
[null,"h",{"$f":"'Minutes 4'!J30","v":0},{"$f":"'Minutes 4'!M30","v":0},{"$f":"'Minutes 4'!O30","v":0},{"$f":"'Minutes 4'!Q30","v":0}]
[null,"TEAM",{"$f":"'Minutes 4'!J31","v":0},{"$f":"'Minutes 4'!M31","v":0},{"$f":"'Minutes 4'!O31","v":0},{"$f":"'Minutes 4'!Q31","v":0}]
[]
[null,null,{"$f":"C$6","v":"% PROFICIENT or higher"},{"$f":"D$6","v":"% CLOSE TO"},"% PROGRESSING","% NEEDS PRACTICE"]
[null,{"$f":"B99","v":"TEAM"},{"$f":"C99","v":0},{"$f":"D99","v":0},{"$f":"E99","v":0},{"$f":"F99","v":0}]
[]
[null,null,{"$f":"Cover!D3&\" \"&Cover!J6","v":" CFA 4"}]
[null,null,{"$f":"C66 & \" Data set 1\"","v":"% PROFICIENT or higher Data set 1"},{"$f":"C66 & \" Data set 2\"","v":"% PROFICIENT or higher Data set 2"},{"$f":"C66 & \"        Data set 3\"","v":"% PROFICIENT or higher        Data set 3"},{"$f":"C66 & \"             Data set 4\"","v":"% PROFICIENT or higher             Data set 4"},{"$f":"D101 & \"         Data set 1\"","v":"% CLOSE TO         Data set 1"},{"$f":"D101 & \"             Data set 2\"","v":"% CLOSE TO             Data set 2"},{"$f":"D101 & \"             Data set 3\"","v":"% CLOSE TO             Data set 3"},{"$f":"D101 & \"                 Data set 4\"","v":"% CLOSE TO                 Data set 4"},{"$f":"E101 & \"           Data set 1\"","v":"% PROGRESSING           Data set 1"},{"$f":"E101 & \"               Data set 2\"","v":"% PROGRESSING               Data set 2"},{"$f":"E101 & \"               Data set 3\"","v":"% PROGRESSING               Data set 3"},{"$f":"E101 & \"               Data set 4\"","v":"% PROGRESSING               Data set 4"},{"$f":"F101 & \"       Data set 1\"","v":"% NEEDS PRACTICE       Data set 1"},{"$f":"F101 & \"         Data set 2\"","v":"% NEEDS PRACTICE         Data set 2"},{"$f":"F101 & \" Data set 3\"","v":"% NEEDS PRACTICE Data set 3"},{"$f":"F101 & \" Data set 4\"","v":"% NEEDS PRACTICE Data set 4"}]
[null,{"$f":"B91","v":"a"},{"$f":"C7","v":0},{"$f":"C22","v":0},{"$f":"C56","v":0},{"$f":"C91","v":0},{"$f":"D7","v":0},{"$f":"D22","v":0},{"$f":"D56","v":0},{"$f":"D91","v":0},{"$f":"E7","v":0},{"$f":"E22","v":0},{"$f":"E56","v":0},{"$f":"E91","v":0},{"$f":"F7","v":0},{"$f":"F22","v":0},{"$f":"F56","v":0},{"$f":"F91","v":0}]
[null,"b",{"$f":"C8","v":0},{"$f":"C23","v":0},{"$f":"C57","v":0},{"$f":"C92","v":0},{"$f":"D8","v":0},{"$f":"D23","v":0},{"$f":"D57","v":0},{"$f":"D92","v":0},{"$f":"E8","v":0},{"$f":"E23","v":0},{"$f":"E57","v":0},{"$f":"E92","v":0},{"$f":"F8","v":0},{"$f":"F23","v":0},{"$f":"F57","v":0},{"$f":"F92","v":0}]
[null,"c",0,0,0,0,0,0,0,0,0,0,0,0,0,0,0,0]
[null,"d",0,0,0,0,0,0,0,0,0,0,0,0,0,0,0,0]
[null,"e",0,0,0,0,0,0,0,0,0,0,0,0,0,0,0,0]
[null,"f",0,0,0,0,0,0,0,0,0,0,0,0,0,0,0,0]
[null,"g",0,0,0,0,0,0,0,0,0,0,0,0,0,0,0,0]
[null,"h",0,0,0,0,0,0,0,0,0,0,0,0,0,0,0,0]
[null,"TEAM",0,0,0,0,0,0,0,0,0,0,{"$f":"E64","v":0},0,0,0,0,0]
[]
[]
[null,null,{"$f":"C$6","v":"% PROFICIENT or higher"},{"$f":"D$6","v":"% CLOSE TO"},"% PROGRESSING","% NEEDS PRACTICE"]
[null,"data1",{"$f":"B114","v":"TEAM"},{"$f":"D114","v":0},{"$f":"G114","v":0},{"$f":"I114","v":0}]
[null,"data2",{"$f":"C114","v":0},{"$f":"E114","v":0},{"$f":"H114","v":0},{"$f":"K114","v":0}]
[null,"data3",{"$f":"E79","v":0},{"$f":"H79","v":0},{"$f":"K79","v":0},{"$f":"N79","v":0}]
[null,"data4",{"$f":"C102","v":0},{"$f":"D102","v":0},{"$f":"E102","v":0},{"$f":"F102","v":0}]

{"sheet":"Tchr1","index":6,"n_rows":189,"n_cols":17,"rows_kept":189,"cut":false,"hidden":false,"merged":[[7,1,7,3],[8,1,8,3],[9,1,9,3],[10,1,10,3],[11,1,11,3],[2,1,2,3],[3,1,3,3],[4,1,4,3],[5,1,5,3],[6,1,6,3]]}
[null,null,null,null,"Teacher:",{"$f":"IF(Cover!D4=\"\",\"\",Cover!D4)","v":""},null,null,null,"Max:",{"$f":"Cover!J12","v":5}]
[null,null,null,null,{"$f":"IF(Cover!L3=\"\",\"\",Cover!L3)","v":""},{"$f":"IF(Cover!L4=\"\",\"\",Cover!L4)","v":""},{"$f":"IF(Cover!L5=\"\",\"\",Cover!L5)","v":""},{"$f":"IF(Cover!L6=\"\",\"\",Cover!L6)","v":""}]
[null,null,null,null,{"$f":"E14","v":"CFA 1 Pre"},{"$f":"F14","v":"CFA 2 Mid"},{"$f":"G14","v":"CFA 3 Post"},{"$f":"H14","v":"CFA 4"},null,null,null,null,null,null,null,"Change"]
[null,"Total Taking:",null,null,{"$f":"COUNT(E15:E189)","v":0},{"$f":"COUNT(F15:F189)","v":0},{"$f":"COUNT(G15:G189)","v":0},{"$f":"COUNT(H15:H189)","v":0},null,"MinExceed:",null,null,null,null,null,{"$f":"IF(H4>0,H4-E4,IF(G4>0,G4-E4,IF(F4>0,F4-E4,IE4)))","v":0}]
[null,{"$f":"\"Number \"&Cover!$K$13&\"  (>=\" & Cover!$J$13 & \")\"","v":"Number PROFICIENT  (>=4)"},null,null,{"$f":"COUNTIF(E15:E189,\">=\"&K5)","v":0},{"$f":"COUNTIF(F15:F189,\">=\"&K5)","v":0},{"$f":"COUNTIF(G15:G189,\">=\"&K5)","v":0},{"$f":"COUNTIF(H15:H189,\">=\"&K5)","v":0},null,"MinProf:",{"$f":"Cover!J13","v":4},null,null,null,null,{"$f":"IF(H5>0,H5-E5,IF(G5>0,G5-E5,IF(F5>0,F5-E5,IE5)))","v":0}]
[null,{"$f":"\"Percent \"&Cover!$K$13&\"  (>=\" & Cover!$J$13 & \")\"","v":"Percent PROFICIENT  (>=4)"},null,null,{"$f":"IF(E4=0,0,E5/E4)","v":0},{"$f":"IF(F4=0,0,F5/F4)","v":0},{"$f":"IF(G4=0,0,G5/G4)","v":0},{"$f":"IF(H4=0,0,H5/H4)","v":0},null,"Close:",{"$f":"Cover!J14","v":3},null,null,null,null,{"$f":"IF(H6>0,H6-E6,IF(G6>0,G6-E6,IF(F6>0,F6-E6,IE6)))","v":0}]
[null,{"$f":"\"Number \"&Cover!$K$14&\" (Between \" & Cover!$J$14 & \" & \" & Cover!$J$13-1 & \")\"","v":"Number CLOSE TO (Between 3 & 3)"},null,null,{"$f":"COUNTIF(E$15:E$189,\">=\"&$K$6)-COUNTIF(E$15:E$189,\">=\"&$K$5)","v":0},{"$f":"COUNTIF(F$15:F$189,\">=\"&$K$6)-COUNTIF(F$15:F$189,\">=\"&$K$5)","v":0},{"$f":"COUNTIF(G$15:G$189,\">=\"&$K$6)-COUNTIF(G$15:G$189,\">=\"&$K$5)","v":0},{"$f":"COUNTIF(H$15:H$189,\">=\"&$K$6)-COUNTIF(H$15:H$189,\">=\"&$K$5)","v":0},null,"Far to Go:",{"$f":"Cover!J15","v":2},null,null,null,null,0]
[null,{"$f":"\"Percent \"&Cover!$K$14&\" (Between \" & Cover!$J$14 & \" & \" & Cover!$J$13-1 & \")\"","v":"Percent CLOSE TO (Between 3 & 3)"},null,null,{"$f":"IF(E4=0,0,E7/E4)","v":0},{"$f":"IF(F4=0,0,F7/F4)","v":0},{"$f":"IF(G4=0,0,G7/G4)","v":0},{"$f":"IF(H4=0,0,H7/H4)","v":0},null,null,null,null,null,null,null,0]
[null,{"$f":"\"Number \"&Cover!$K$15&\" (Between \" & Cover!$J$15 & \" & \" & Cover!$J$14-1 & \")\"","v":"Number PROGRESSING (Between 2 & 2)"},null,null,{"$f":"COUNTIF(E$15:E$189,\">=\"&$K$7)-COUNTIF(E$15:E$189,\">=\"&$K$6)","v":0},{"$f":"COUNTIF(F$15:F$189,\">=\"&$K$7)-COUNTIF(F$15:F$189,\">=\"&$K$6)","v":0},{"$f":"COUNTIF(G$15:G$189,\">=\"&$K$7)-COUNTIF(G$15:G$189,\">=\"&$K$6)","v":0},{"$f":"COUNTIF(H$15:H$189,\">=\"&$K$7)-COUNTIF(H$15:H$189,\">=\"&$K$6)","v":0},null,null,null,null,null,null,null,0]
[null,{"$f":"\"Percent \"&Cover!$K$15&\" (Between \" & Cover!$J$15 & \" & \" & Cover!$J$14-1 & \")\"","v":"Percent PROGRESSING (Between 2 & 2)"},null,null,{"$f":"IF(E4=0,0,E9/E4)","v":0},{"$f":"IF(F4=0,0,F9/F4)","v":0},{"$f":"IF(G4=0,0,G9/G4)","v":0},{"$f":"IF(H4=0,0,H9/H4)","v":0},null,null,null,null,null,null,null,0]
[null,{"$f":"\"Number \"&Cover!$K$16&\" (Between \" & Cover!$J$16 & \" & \" & Cover!$J$15-1 & \")\"","v":"Number NEEDS PRACTICE (Between 1 & 1)"},null,null,{"$f":"COUNTIF(E$15:E$189,\"<\"&$K$7)","v":0},{"$f":"COUNTIF(F$15:F$189,\"<\"&$K$7)","v":0},{"$f":"COUNTIF(G$15:G$189,\"<\"&$K$7)","v":0},{"$f":"COUNTIF(H$15:H$189,\"<\"&$K$7)","v":0},null,null,null,null,null,null,null,0]
[null,{"$f":"\"Percent \"&Cover!$K$16&\" (Between \" & Cover!$J$16 & \" & \" & Cover!$J$15-1 & \")\"","v":"Percent NEEDS PRACTICE (Between 1 & 1)"},null,null,{"$f":"IF(E4=0,0,E11/E4)","v":0},{"$f":"IF(F4=0,0,F11/F4)","v":0},{"$f":"IF(G4=0,0,G11/G4)","v":0},{"$f":"IF(H4=0,0,H11/H4)","v":0},{"$f":"CONCATENATE(I15,I16,I17,I18,I19,I20,I21,I22,I23,I24,I25,I26,I27,I28,I29,I30,I31,I32,I33,I34,I35,I36,I37,I38,I39,I40,I41,I42,I43,I44,I45,I46,I47,I48,I49,I50,I51,I52,I53,I54,I55,I56,I57,I58,I59,I60,I61,I62,I63,I64,I65,I66,I67,I68,I69,I70,I71,I72,I73,I74,I75,I76,I77,I78,I79,I80,I81,I82,I83,I84,I85,I86,I87,I88,I89,I90,I91,I92,I93,I94,I95,I96,I97,I98,I99,I100,I101,I102,I103,I104,I105,I106,I107,I108,I109,I110,I111,I112,I113,I114,I115,I116,I117,I118,I119,I120,I121,I122,I123,I124,I125,I126,I127,I128,I129,I130,I131,I132,I133,I134,I135,I136,I137,I138,I139,I140,I141,I142,I143,I144,I145,I146,I147,I148,I149,I150,I151,I152,I153,I154,I155,I156,I157,I158,I159,I160,I161,I162,I163,I164)","v":""},{"$f":"CONCATENATE(J15,J16,J17,J18,J19,J20,J21,J22,J23,J24,J25,J26,J27,J28,J29,J30,J31,J32,J33,J34,J35,J36,J37,J38,J39,J40,J41,J42,J43,J44,J45,J46,J47,J48,J49,J50,J51,J52,J53,J54,J55,J56,J57,J58,J59,J60,J61,J62,J63,J64,J65,J66,J67,J68,J69,J70,J71,J72,J73,J74,J75,J76,J77,J78,J79,J80,J81,J82,J83,J84,J85,J86,J87,J88,J89,J90,J91,J92,J93,J94,J95,J96,J97,J98,J99,J100,J101,J102,J103,J104,J105,J106,J107,J108,J109,J110,J111,J112,J113,J114,J115,J116,J117,J118,J119,J120,J121,J122,J123,J124,J125,J126,J127,J128,J129,J130,J131,J132,J133,J134,J135,J136,J137,J138,J139,J140,J141,J142,J143,J144,J145,J146,J147,J148,J149,J150,J151,J152,J153,J154,J155,J156,J157,J158,J159,J160,J161,J162,J163,J164)","v":""},"","","","",null,{"$f":"IF(H12>0,H12-E12,IF(G12>0,G12-E12,IF(F12>0,F12-E12,IE12)))","v":0}]
[]
[null,"Period","Student Number","Student Name",{"$f":"IF(Cover!J3=\"\",\"\",Cover!J3)","v":"CFA 1 Pre"},{"$f":"IF(Cover!J4=\"\",\"\",Cover!J4)","v":"CFA 2 Mid"},{"$f":"IF(Cover!J5=\"\",\"\",Cover!J5)","v":"CFA 3 Post"},{"$f":"IF(Cover!J6=\"\",\"\",Cover!J6)","v":"CFA 4"},"Pre Close","Pre Far Likely","Pre Extensive","Post Close","Post Far to Go ","Post Extensive",null,"Growth","Return to Cover"]
[null,null,null,null,null,null,null,null,{"$f":"IF(E15>=$K$5,\"\",IF(E15>=$K$6,($D15&\", \"),\"\"))","v":""},{"$f":"IF(E15>=$K$6,\"\",IF(E15>=$K$7,($D15&\", \"),\"\"))","v":""},{"$f":"IF($E15=\"\",\"\",IF($E15<$K$7,$D15&\", \",\"\"))","v":""},{"$f":"IF(H15>=$K$5,\"\",IF(H15>=$K$6,($D15&\", \"),\"\"))","v":""},{"$f":"IF(H15>=$K$6,\"\",IF(H15>=$K$7,($D15&\", \"),\"\"))","v":""},{"$f":"IF($H15=\"\",\"\",IF($H15<$K$7,$D15&\", \",\"\"))","v":""},null,{"$f":"IF(H15<>\"\",H15-E15,IF(G15<>\"\",G15-E15,IF(F15<>\"\",F15-E15,IE15)))","v":0}]
[null,null,null,null,null,null,null,null,{"$f":"IF(E16>=$K$5,\"\",IF(E16>=$K$6,($D16&\", \"),\"\"))","v":""},"",{"$f":"IF($E16=\"\",\"\",IF($E16<$K$7,$D16&\", \",\"\"))","v":""},"","","",null,{"$f":"IF(H16<>\"\",H16-E16,IF(G16<>\"\",G16-E16,IF(F16<>\"\",F16-E16,IE16)))","v":0}]
[null,null,null,null,null,null,null,null,"","","","","","",null,{"$f":"IF(H17<>\"\",H17-E17,IF(G17<>\"\",G17-E17,IF(F17<>\"\",F17-E17,IE17)))","v":0}]
[null,null,null,null,null,null,null,null,"","","","","","",null,0]
[null,null,null,null,null,null,null,null,"","","","","","",null,0]
[null,null,null,null,null,null,null,null,"","","","","","",null,0]
[null,null,null,null,null,null,null,null,"","","","","","",null,0]
[null,null,null,null,null,null,null,null,"","","","","","",null,0]
[null,null,null,null,null,null,null,null,"","","","","","",null,0]
[null,null,null,null,null,null,null,null,"","","","","","",null,0]
[null,null,null,null,null,null,null,null,"","","","","","",null,0]
[null,null,null,null,null,null,null,null,"","","","","","",null,0]
[null,null,null,null,null,null,null,null,"","","","","","",null,0]
[null,null,null,null,null,null,null,null,"","","","","","",null,0]
[null,null,null,null,null,null,null,null,"","","","","","",null,0]
[null,null,null,null,null,null,null,null,"","","","","","",null,0]
[null,null,null,null,null,null,null,null,"","","","","","",null,0]
[null,null,null,null,null,null,null,null,"","","","","","",null,0]
[null,null,null,null,null,null,null,null,"","","","","","",null,0]
[null,null,null,null,null,null,null,null,"","","","","","",null,0]
[null,null,null,null,null,null,null,null,"","","","","","",null,0]
[null,null,null,null,null,null,null,null,"","","","","","",null,0]
[null,null,null,null,null,null,null,null,"","","","","","",null,0]
[null,null,null,null,null,null,null,null,"","","","","","",null,0]
[null,null,null,null,null,null,null,null,"","","","","","",null,0]
[null,null,null,null,null,null,null,null,"","","","","","",null,0]
[null,null,null,null,null,null,null,null,"","","","","","",null,0]
[null,null,null,null,null,null,null,null,"","","","","","",null,0]
[null,null,null,null,null,null,null,null,"","","","","","",null,0]
[null,null,null,null,null,null,null,null,"","","","","","",null,0]
[null,null,null,null,null,null,null,null,"","","","","","",null,0]
[null,null,null,null,null,null,null,null,"","","","","","",null,0]
[null,null,null,null,null,null,null,null,"","","",{"$f":"IF(H47>=$K$5,\"\",IF(H47>=$K$6,($D47&\", \"),\"\"))","v":""},{"$f":"IF(H47>=$K$6,\"\",IF(H47>=$K$7,($D47&\", \"),\"\"))","v":""},{"$f":"IF($H47=\"\",\"\",IF($H47<$K$7,$D47&\", \",\"\"))","v":""},null,0]
[null,null,null,null,null,null,null,null,"","","","","","",null,0]
[null,null,null,null,null,null,null,null,"","","","","","",null,0]
[null,null,null,null,null,null,null,null,"","","","","","",null,0]
[null,null,null,null,null,null,null,null,"","","","","","",null,0]
[null,null,null,null,null,null,null,null,"","","","","","",null,0]
[null,null,null,null,null,null,null,null,"","","","","","",null,0]
[null,null,null,null,null,null,null,null,"","","","","","",null,0]
[null,null,null,null,null,null,null,null,"","","","","","",null,0]
[null,null,null,null,null,null,null,null,"","","","","","",null,0]
[null,null,null,null,null,null,null,null,"","","","","","",null,0]
[null,null,null,null,null,null,null,null,"","","","","","",null,0]
[null,null,null,null,null,null,null,null,"","","","","","",null,0]
[null,null,null,null,null,null,null,null,"","","","","","",null,0]
[null,null,null,null,null,null,null,null,"","","","","","",null,0]
[null,null,null,null,null,null,null,null,"","","","","","",null,0]
[null,null,null,null,null,null,null,null,"","","","","","",null,0]
[null,null,null,null,null,null,null,null,"","","","","","",null,0]
[null,null,null,null,null,null,null,null,"","","","","","",null,0]
[null,null,null,null,null,null,null,null,"","","","","","",null,0]
[null,null,null,null,null,null,null,null,"","","","","","",null,0]
[null,null,null,null,null,null,null,null,"","","","","","",null,0]
[null,null,null,null,null,null,null,null,"","","","","","",null,0]
[null,null,null,null,null,null,null,null,"","","","","","",null,0]
[null,null,null,null,null,null,null,null,"","","","","","",null,0]
[null,null,null,null,null,null,null,null,"","","","","","",null,0]
[null,null,null,null,null,null,null,null,"","","","","","",null,0]
[null,null,null,null,null,null,null,null,"","","","","","",null,0]
[null,null,null,null,null,null,null,null,"","","","","","",null,0]
[null,null,null,null,null,null,null,null,"","","","","","",null,0]
[null,null,null,null,null,null,null,null,"","","","","","",null,0]
[null,null,null,null,null,null,null,null,"","","","","","",null,0]
[null,null,null,null,null,null,null,null,"",{"$f":"IF(E79>=$K$6,\"\",IF(E79>=$K$7,($D79&\", \"),\"\"))","v":""},"",{"$f":"IF(H79>=$K$5,\"\",IF(H79>=$K$6,($D79&\", \"),\"\"))","v":""},{"$f":"IF(H79>=$K$6,\"\",IF(H79>=$K$7,($D79&\", \"),\"\"))","v":""},{"$f":"IF($H79=\"\",\"\",IF($H79<$K$7,$D79&\", \",\"\"))","v":""},null,0]
[null,null,null,null,null,null,null,null,{"$f":"IF(E80>=$K$5,\"\",IF(E80>=$K$6,($D80&\", \"),\"\"))","v":""},"",{"$f":"IF($E80=\"\",\"\",IF($E80<$K$7,$D80&\", \",\"\"))","v":""},"","","",null,0]
[null,null,null,null,null,null,null,null,"","","","","","",null,{"$f":"IF(H81<>\"\",H81-E81,IF(G81<>\"\",G81-E81,IF(F81<>\"\",F81-E81,IE81)))","v":0}]
[null,null,null,null,null,null,null,null,"","","","","","",null,0]
[null,null,null,null,null,null,null,null,"","","","","","",null,0]
[null,null,null,null,null,null,null,null,"","","","","","",null,0]
[null,null,null,null,null,null,null,null,"","","","","","",null,0]
[null,null,null,null,null,null,null,null,"","","","","","",null,0]
[null,null,null,null,null,null,null,null,"","","","","","",null,0]
[null,null,null,null,null,null,null,null,"","","","","","",null,0]
[null,null,null,null,null,null,null,null,"","","","","","",null,0]
[null,null,null,null,null,null,null,null,"","","","","","",null,0]
[null,null,null,null,null,null,null,null,"","","","","","",null,0]
[null,null,null,null,null,null,null,null,"","","","","","",null,0]
[null,null,null,null,null,null,null,null,"","","","","","",null,0]
[null,null,null,null,null,null,null,null,"","","","","","",null,0]
[null,null,null,null,null,null,null,null,"","","","","","",null,0]
[null,null,null,null,null,null,null,null,"","","","","","",null,0]
[null,null,null,null,null,null,null,null,"","","","","","",null,0]
[null,null,null,null,null,null,null,null,"","","","","","",null,0]
[null,null,null,null,null,null,null,null,"","","","","","",null,0]
[null,null,null,null,null,null,null,null,"","","","","","",null,0]
[null,null,null,null,null,null,null,null,"","","","","","",null,0]
[null,null,null,null,null,null,null,null,"","","","","","",null,0]
[null,null,null,null,null,null,null,null,"","","","","","",null,0]
[null,null,null,null,null,null,null,null,"","","","","","",null,0]
[null,null,null,null,null,null,null,null,"","","","","","",null,0]
[null,null,null,null,null,null,null,null,"","","","","","",null,0]
[null,null,null,null,null,null,null,null,"","","","","","",null,0]
[null,null,null,null,null,null,null,null,"","","","","","",null,0]
[null,null,null,null,null,null,null,null,"","","","","","",null,0]
[null,null,null,null,null,null,null,null,"","","","","","",null,0]
[null,null,null,null,null,null,null,null,"","","",{"$f":"IF(H111>=$K$5,\"\",IF(H111>=$K$6,($D111&\", \"),\"\"))","v":""},{"$f":"IF(H111>=$K$6,\"\",IF(H111>=$K$7,($D111&\", \"),\"\"))","v":""},{"$f":"IF($H111=\"\",\"\",IF($H111<$K$7,$D111&\", \",\"\"))","v":""},null,0]
[null,null,null,null,null,null,null,null,"","","","","","",null,0]
[null,null,null,null,null,null,null,null,"","","","","","",null,0]
[null,null,null,null,null,null,null,null,"","","","","","",null,0]
[null,null,null,null,null,null,null,null,"","","","","","",null,0]
[null,null,null,null,null,null,null,null,"","","","","","",null,0]
[null,null,null,null,null,null,null,null,"","","","","","",null,0]
[null,null,null,null,null,null,null,null,"","","","","","",null,0]
[null,null,null,null,null,null,null,null,"","","","","","",null,0]
[null,null,null,null,null,null,null,null,"","","","","","",null,0]
[null,null,null,null,null,null,null,null,"","","","","","",null,0]
[null,null,null,null,null,null,null,null,"","","","","","",null,0]
[null,null,null,null,null,null,null,null,"","","","","","",null,0]
[null,null,null,null,null,null,null,null,"","","","","","",null,0]
[null,null,null,null,null,null,null,null,"","","","","","",null,0]
[null,null,null,null,null,null,null,null,"","","","","","",null,0]
[null,null,null,null,null,null,null,null,"","","","","","",null,0]
[null,null,null,null,null,null,null,null,"","","","","","",null,0]
[null,null,null,null,null,null,null,null,"","","","","","",null,0]
[null,null,null,null,null,null,null,null,"","","","","","",null,0]
[null,null,null,null,null,null,null,null,"","","","","","",null,0]
[null,null,null,null,null,null,null,null,"","","","","","",null,0]
[null,null,null,null,null,null,null,null,"","","","","","",null,0]
[null,null,null,null,null,null,null,null,"","","","","","",null,0]
[null,null,null,null,null,null,null,null,"","","","","","",null,0]
[null,null,null,null,null,null,null,null,"","","","","","",null,0]
[null,null,null,null,null,null,null,null,"","","","","","",null,0]
[null,null,null,null,null,null,null,null,"","","","","","",null,0]
[null,null,null,null,null,null,null,null,"","","","","","",null,0]
[null,null,null,null,null,null,null,null,"","","","","","",null,0]
[null,null,null,null,null,null,null,null,"","","","","","",null,0]
[null,null,null,null,null,null,null,null,"","","","","","",null,0]
[null,null,null,null,null,null,null,null,"",{"$f":"IF(E143>=$K$6,\"\",IF(E143>=$K$7,($D143&\", \"),\"\"))","v":""},"",{"$f":"IF(H143>=$K$5,\"\",IF(H143>=$K$6,($D143&\", \"),\"\"))","v":""},{"$f":"IF(H143>=$K$6,\"\",IF(H143>=$K$7,($D143&\", \"),\"\"))","v":""},{"$f":"IF($H143=\"\",\"\",IF($H143<$K$7,$D143&\", \",\"\"))","v":""},null,0]
[null,null,null,null,null,null,null,null,{"$f":"IF(E144>=$K$5,\"\",IF(E144>=$K$6,($D144&\", \"),\"\"))","v":""},"",{"$f":"IF($E144=\"\",\"\",IF($E144<$K$7,$D144&\", \",\"\"))","v":""},"","","",null,0]
[null,null,null,null,null,null,null,null,"","","","","","",null,{"$f":"IF(H145<>\"\",H145-E145,IF(G145<>\"\",G145-E145,IF(F145<>\"\",F145-E145,IE145)))","v":0}]
[null,null,null,null,null,null,null,null,"","","","","","",null,0]
[null,null,null,null,null,null,null,null,"","","","","","",null,0]
[null,null,null,null,null,null,null,null,"","","","","","",null,0]
[null,null,null,null,null,null,null,null,"","","","","","",null,0]
[null,null,null,null,null,null,null,null,"","","","","","",null,0]
[null,null,null,null,null,null,null,null,"","","","","","",null,0]
[null,null,null,null,null,null,null,null,"","","","","","",null,0]
[null,null,null,null,null,null,null,null,"","","","","","",null,0]
[null,null,null,null,null,null,null,null,"","","","","","",null,0]
[null,null,null,null,null,null,null,null,"","","","","","",null,0]
[null,null,null,null,null,null,null,null,"","","","","","",null,0]
[null,null,null,null,null,null,null,null,"","","","","","",null,0]
[null,null,null,null,null,null,null,null,"","","","","","",null,0]
[null,null,null,null,null,null,null,null,"","","","","","",null,0]
[null,null,null,null,null,null,null,null,"","","","","","",null,0]
[null,null,null,null,null,null,null,null,"","","","","","",null,0]
[null,null,null,null,null,null,null,null,"","","","","","",null,0]
[null,null,null,null,null,null,null,null,"","","","","","",null,0]
[null,null,null,null,null,null,null,null,"","","","","","",null,0]
[null,null,null,null,null,null,null,null,null,null,null,null,null,null,null,0]
[null,null,null,null,null,null,null,null,null,null,null,null,null,null,null,0]
[null,null,null,null,null,null,null,null,null,null,null,null,null,null,null,0]
[null,null,null,null,null,null,null,null,null,null,null,null,null,null,null,0]
[null,null,null,null,null,null,null,null,null,null,null,null,null,null,null,0]
[null,null,null,null,null,null,null,null,null,null,null,null,null,null,null,0]
[null,null,null,null,null,null,null,null,null,null,null,null,null,null,null,0]
[null,null,null,null,null,null,null,null,null,null,null,null,null,null,null,0]
[null,null,null,null,null,null,null,null,null,null,null,null,null,null,null,0]
[null,null,null,null,null,null,null,null,null,null,null,null,null,null,null,0]
[null,null,null,null,null,null,null,null,null,null,null,null,null,null,null,0]
[null,null,null,null,null,null,null,null,null,null,null,null,null,null,null,0]
[null,null,null,null,null,null,null,null,null,null,null,null,null,null,null,0]
[null,null,null,null,null,null,null,null,null,null,null,null,null,null,null,0]
[null,null,null,null,null,null,null,null,null,null,null,null,null,null,null,0]
[null,null,null,null,null,null,null,null,null,null,null,null,null,null,null,0]
[null,null,null,null,null,null,null,null,null,null,null,null,null,null,null,0]
[null,null,null,null,null,null,null,null,null,null,null,null,null,null,null,0]
[null,null,null,null,null,null,null,null,null,null,null,null,null,null,null,0]
[null,null,null,null,null,null,null,null,null,null,null,null,null,null,null,0]
[null,null,null,null,null,null,null,null,null,null,null,null,null,null,null,0]
[null,null,null,null,null,null,null,null,null,null,null,null,null,null,null,0]
[null,null,null,null,null,null,null,null,null,null,null,null,null,null,null,0]
[null,null,null,null,null,null,null,null,null,null,null,null,null,null,null,0]
[null,null,null,null,null,null,null,null,null,null,null,null,null,null,null,0]

{"sheet":"Tchr2","index":7,"n_rows":189,"n_cols":17,"rows_kept":189,"cut":false,"hidden":false,"merged":[[8,1,8,3],[9,1,9,3],[10,1,10,3],[11,1,11,3],[2,1,2,3],[3,1,3,3],[4,1,4,3],[5,1,5,3],[6,1,6,3],[7,1,7,3]]}
[null,null,null,null,"Teacher:",{"$f":"IF(Cover!D5=\"\",\"\",Cover!D5)","v":""},null,null,null,"Max:",{"$f":"Cover!J12","v":5}]
[null,null,null,null,{"$f":"IF(Cover!L3=\"\",\"\",Cover!L3)","v":""},{"$f":"IF(Cover!L4=\"\",\"\",Cover!L4)","v":""},{"$f":"IF(Cover!L5=\"\",\"\",Cover!L5)","v":""},{"$f":"IF(Cover!L6=\"\",\"\",Cover!L6)","v":""}]
[null,null,null,null,{"$f":"E14","v":"CFA 1 Pre"},{"$f":"F14","v":"CFA 2 Mid"},{"$f":"G14","v":"CFA 3 Post"},{"$f":"H14","v":"CFA 4"},null,null,null,null,null,null,null,"Change"]
[null,"Total Taking:",null,null,{"$f":"COUNT(E15:E189)","v":0},{"$f":"COUNT(F15:F189)","v":0},{"$f":"COUNT(G15:G189)","v":0},{"$f":"COUNT(H15:H189)","v":0},null,"MinExceed:",null,null,null,null,null,{"$f":"IF(H4>0,H4-E4,IF(G4>0,G4-E4,IF(F4>0,F4-E4,IE4)))","v":0}]
[null,{"$f":"\"Number \"&Cover!$K$13&\"  (>=\" & Cover!$J$13 & \")\"","v":"Number PROFICIENT  (>=4)"},null,null,{"$f":"COUNTIF(E15:E189,\">=\"&K5)","v":0},{"$f":"COUNTIF(F15:F189,\">=\"&K5)","v":0},{"$f":"COUNTIF(G15:G189,\">=\"&K5)","v":0},{"$f":"COUNTIF(H15:H189,\">=\"&K5)","v":0},null,"MinProf:",{"$f":"Cover!J13","v":4},null,null,null,null,{"$f":"IF(H5>0,H5-E5,IF(G5>0,G5-E5,IF(F5>0,F5-E5,IE5)))","v":0}]
[null,{"$f":"\"Percent \"&Cover!$K$13&\"  (>=\" & Cover!$J$13 & \")\"","v":"Percent PROFICIENT  (>=4)"},null,null,{"$f":"IF(E4=0,0,E5/E4)","v":0},{"$f":"IF(F4=0,0,F5/F4)","v":0},{"$f":"IF(G4=0,0,G5/G4)","v":0},{"$f":"IF(H4=0,0,H5/H4)","v":0},null,"Close:",{"$f":"Cover!J14","v":3},null,null,null,null,0]
[null,{"$f":"\"Number \"&Cover!$K$14&\" (Between \" & Cover!$J$14 & \" & \" & Cover!$J$13-1 & \")\"","v":"Number CLOSE TO (Between 3 & 3)"},null,null,{"$f":"COUNTIF(E$15:E$189,\">=\"&$K$6)-COUNTIF(E$15:E$189,\">=\"&$K$5)","v":0},{"$f":"COUNTIF(F$15:F$189,\">=\"&$K$6)-COUNTIF(F$15:F$189,\">=\"&$K$5)","v":0},{"$f":"COUNTIF(G$15:G$189,\">=\"&$K$6)-COUNTIF(G$15:G$189,\">=\"&$K$5)","v":0},{"$f":"COUNTIF(H$15:H$189,\">=\"&$K$6)-COUNTIF(H$15:H$189,\">=\"&$K$5)","v":0},null,"Far to Go:",{"$f":"Cover!J15","v":2},null,null,null,null,0]
[null,{"$f":"\"Percent \"&Cover!$K$14&\" (Between \" & Cover!$J$14 & \" & \" & Cover!$J$13-1 & \")\"","v":"Percent CLOSE TO (Between 3 & 3)"},null,null,{"$f":"IF(E4=0,0,E7/E4)","v":0},{"$f":"IF(F4=0,0,F7/F4)","v":0},{"$f":"IF(G4=0,0,G7/G4)","v":0},{"$f":"IF(H4=0,0,H7/H4)","v":0},null,null,null,null,null,null,null,0]
[null,{"$f":"\"Number \"&Cover!$K$15&\" (Between \" & Cover!$J$15 & \" & \" & Cover!$J$14-1 & \")\"","v":"Number PROGRESSING (Between 2 & 2)"},null,null,{"$f":"COUNTIF(E$15:E$189,\">=\"&$K$7)-COUNTIF(E$15:E$189,\">=\"&$K$6)","v":0},{"$f":"COUNTIF(F$15:F$189,\">=\"&$K$7)-COUNTIF(F$15:F$189,\">=\"&$K$6)","v":0},{"$f":"COUNTIF(G$15:G$189,\">=\"&$K$7)-COUNTIF(G$15:G$189,\">=\"&$K$6)","v":0},{"$f":"COUNTIF(H$15:H$189,\">=\"&$K$7)-COUNTIF(H$15:H$189,\">=\"&$K$6)","v":0},null,null,null,null,null,null,null,0]
[null,{"$f":"\"Percent \"&Cover!$K$15&\" (Between \" & Cover!$J$15 & \" & \" & Cover!$J$14-1 & \")\"","v":"Percent PROGRESSING (Between 2 & 2)"},null,null,{"$f":"IF(E4=0,0,E9/E4)","v":0},{"$f":"IF(F4=0,0,F9/F4)","v":0},{"$f":"IF(G4=0,0,G9/G4)","v":0},{"$f":"IF(H4=0,0,H9/H4)","v":0},null,null,null,null,null,null,null,{"$f":"IF(H10>0,H10-E10,IF(G10>0,G10-E10,IF(F10>0,F10-E10,IE10)))","v":0}]
[null,{"$f":"\"Number \"&Cover!$K$16&\" (Between \" & Cover!$J$16 & \" & \" & Cover!$J$15-1 & \")\"","v":"Number NEEDS PRACTICE (Between 1 & 1)"},null,null,{"$f":"COUNTIF(E$15:E$189,\"<\"&$K$7)","v":0},{"$f":"COUNTIF(F$15:F$189,\"<\"&$K$7)","v":0},{"$f":"COUNTIF(G$15:G$189,\"<\"&$K$7)","v":0},{"$f":"COUNTIF(H$15:H$189,\"<\"&$K$7)","v":0},null,null,null,null,null,null,null,0]
[null,{"$f":"\"Percent \"&Cover!$K$16&\" (Between \" & Cover!$J$16 & \" & \" & Cover!$J$15-1 & \")\"","v":"Percent NEEDS PRACTICE (Between 1 & 1)"},null,null,{"$f":"IF(E4=0,0,E11/E4)","v":0},{"$f":"IF(F4=0,0,F11/F4)","v":0},{"$f":"IF(G4=0,0,G11/G4)","v":0},{"$f":"IF(H4=0,0,H11/H4)","v":0},{"$f":"CONCATENATE(I15,I16,I17,I18,I19,I20,I21,I22,I23,I24,I25,I26,I27,I28,I29,I30,I31,I32,I33,I34,I35,I36,I37,I38,I39,I40,I41,I42,I43,I44,I45,I46,I47,I48,I49,I50,I51,I52,I53,I54,I55,I56,I57,I58,I59,I60,I61,I62,I63,I64,I65,I66,I67,I68,I69,I70,I71,I72,I73,I74,I75,I76,I77,I78,I79,I80,I81,I82,I83,I84,I85,I86,I87,I88,I89,I90,I91,I92,I93,I94,I95,I96,I97,I98,I99,I100,I101,I102,I103,I104,I105,I106,I107,I108,I109,I110,I111,I112,I113,I114,I115,I116,I117,I118,I119,I120,I121,I122,I123,I124,I125,I126,I127,I128,I129,I130,I131,I132,I133,I134,I135,I136,I137,I138,I139,I140,I141,I142,I143,I144,I145,I146,I147,I148,I149,I150,I151,I152,I153,I154,I155,I156,I157,I158,I159,I160,I161,I162,I163,I164)","v":""},{"$f":"CONCATENATE(J15,J16,J17,J18,J19,J20,J21,J22,J23,J24,J25,J26,J27,J28,J29,J30,J31,J32,J33,J34,J35,J36,J37,J38,J39,J40,J41,J42,J43,J44,J45,J46,J47,J48,J49,J50,J51,J52,J53,J54,J55,J56,J57,J58,J59,J60,J61,J62,J63,J64,J65,J66,J67,J68,J69,J70,J71,J72,J73,J74,J75,J76,J77,J78,J79,J80,J81,J82,J83,J84,J85,J86,J87,J88,J89,J90,J91,J92,J93,J94,J95,J96,J97,J98,J99,J100,J101,J102,J103,J104,J105,J106,J107,J108,J109,J110,J111,J112,J113,J114,J115,J116,J117,J118,J119,J120,J121,J122,J123,J124,J125,J126,J127,J128,J129,J130,J131,J132,J133,J134,J135,J136,J137,J138,J139,J140,J141,J142,J143,J144,J145,J146,J147,J148,J149,J150,J151,J152,J153,J154,J155,J156,J157,J158,J159,J160,J161,J162,J163,J164)","v":""},"","","","",null,{"$f":"IF(H12>0,H12-E12,IF(G12>0,G12-E12,IF(F12>0,F12-E12,IE12)))","v":0}]
[]
[null,"Period","Student Number","Student Name",{"$f":"IF(Cover!J3=\"\",\"\",Cover!J3)","v":"CFA 1 Pre"},{"$f":"IF(Cover!J4=\"\",\"\",Cover!J4)","v":"CFA 2 Mid"},{"$f":"IF(Cover!J5=\"\",\"\",Cover!J5)","v":"CFA 3 Post"},{"$f":"IF(Cover!J6=\"\",\"\",Cover!J6)","v":"CFA 4"},"Pre Close","Pre Far Likely","Pre Extensive","Post Close","Post Far to Go ","Post Extensive",null,"Growth","Return to Cover"]
[null,null,null,null,null,null,null,null,{"$f":"IF(E15>=$K$5,\"\",IF(E15>=$K$6,($D15&\", \"),\"\"))","v":""},{"$f":"IF(E15>=$K$6,\"\",IF(E15>=$K$7,($D15&\", \"),\"\"))","v":""},{"$f":"IF($E15=\"\",\"\",IF($E15<$K$7,$D15&\", \",\"\"))","v":""},{"$f":"IF(H15>=$K$5,\"\",IF(H15>=$K$6,($D15&\", \"),\"\"))","v":""},{"$f":"IF(H15>=$K$6,\"\",IF(H15>=$K$7,($D15&\", \"),\"\"))","v":""},{"$f":"IF($H15=\"\",\"\",IF($H15<$K$7,$D15&\", \",\"\"))","v":""},null,{"$f":"IF(H15<>\"\",H15-E15,IF(G15<>\"\",G15-E15,IF(F15<>\"\",F15-E15,IE15)))","v":0}]
[null,null,null,null,null,null,null,null,"","","","","","",null,{"$f":"IF(H16<>\"\",H16-E16,IF(G16<>\"\",G16-E16,IF(F16<>\"\",F16-E16,IE16)))","v":0}]
[null,null,null,null,null,null,null,null,"","","","","","",null,0]
[null,null,null,null,null,null,null,null,"","","","","","",null,0]
[null,null,null,null,null,null,null,null,"","","","","","",null,0]
[null,null,null,null,null,null,null,null,"","","","","","",null,0]
[null,null,null,null,null,null,null,null,"","","","","","",null,0]
[null,null,null,null,null,null,null,null,"","","","","","",null,0]
[null,null,null,null,null,null,null,null,"","","","","","",null,0]
[null,null,null,null,null,null,null,null,"","","","","","",null,0]
[null,null,null,null,null,null,null,null,"","","","","","",null,0]
[null,null,null,null,null,null,null,null,"","","","","","",null,0]
[null,null,null,null,null,null,null,null,"","","","","","",null,0]
[null,null,null,null,null,null,null,null,"","","","","","",null,0]
[null,null,null,null,null,null,null,null,"","","","","","",null,0]
[null,null,null,null,null,null,null,null,"","","","","","",null,0]
[null,null,null,null,null,null,null,null,"","","","","","",null,0]
[null,null,null,null,null,null,null,null,"","","","","","",null,0]
[null,null,null,null,null,null,null,null,"","","","","","",null,0]
[null,null,null,null,null,null,null,null,"","","","","","",null,0]
[null,null,null,null,null,null,null,null,"","","","","","",null,0]
[null,null,null,null,null,null,null,null,"","","","","","",null,0]
[null,null,null,null,null,null,null,null,"","","","","","",null,0]
[null,null,null,null,null,null,null,null,"","","","","","",null,0]
[null,null,null,null,null,null,null,null,"","","","","","",null,0]
[null,null,null,null,null,null,null,null,"","","","","","",null,0]
[null,null,null,null,null,null,null,null,"","","","","","",null,0]
[null,null,null,null,null,null,null,null,"","","","","","",null,0]
[null,null,null,null,null,null,null,null,"","","","","","",null,0]
[null,null,null,null,null,null,null,null,"","","","","","",null,0]
[null,null,null,null,null,null,null,null,"","","","","","",null,0]
[null,null,null,null,null,null,null,null,"","","","","","",null,0]
[null,null,null,null,null,null,null,null,{"$f":"IF(E47>=$K$5,\"\",IF(E47>=$K$6,($D47&\", \"),\"\"))","v":""},{"$f":"IF(E47>=$K$6,\"\",IF(E47>=$K$7,($D47&\", \"),\"\"))","v":""},{"$f":"IF($E47=\"\",\"\",IF($E47<$K$7,$D47&\", \",\"\"))","v":""},{"$f":"IF(H47>=$K$5,\"\",IF(H47>=$K$6,($D47&\", \"),\"\"))","v":""},{"$f":"IF(H47>=$K$6,\"\",IF(H47>=$K$7,($D47&\", \"),\"\"))","v":""},{"$f":"IF($H47=\"\",\"\",IF($H47<$K$7,$D47&\", \",\"\"))","v":""},null,0]
[null,null,null,null,null,null,null,null,"","","","","","",null,0]
[null,null,null,null,null,null,null,null,"","","","","","",null,0]
[null,null,null,null,null,null,null,null,"","","","","","",null,0]
[null,null,null,null,null,null,null,null,"","","","","","",null,0]
[null,null,null,null,null,null,null,null,"","","","","","",null,0]
[null,null,null,null,null,null,null,null,"","","","","","",null,0]
[null,null,null,null,null,null,null,null,"","","","","","",null,0]
[null,null,null,null,null,null,null,null,"","","","","","",null,0]
[null,null,null,null,null,null,null,null,"","","","","","",null,0]
[null,null,null,null,null,null,null,null,"","","","","","",null,0]
[null,null,null,null,null,null,null,null,"","","","","","",null,0]
[null,null,null,null,null,null,null,null,"","","","","","",null,0]
[null,null,null,null,null,null,null,null,"","","","","","",null,0]
[null,null,null,null,null,null,null,null,"","","","","","",null,0]
[null,null,null,null,null,null,null,null,"","","","","","",null,0]
[null,null,null,null,null,null,null,null,"","","","","","",null,0]
[null,null,null,null,null,null,null,null,"","","","","","",null,0]
[null,null,null,null,null,null,null,null,"","","","","","",null,0]
[null,null,null,null,null,null,null,null,"","","","","","",null,0]
[null,null,null,null,null,null,null,null,"","","","","","",null,0]
[null,null,null,null,null,null,null,null,"","","","","","",null,0]
[null,null,null,null,null,null,null,null,"","","","","","",null,0]
[null,null,null,null,null,null,null,null,"","","","","","",null,0]
[null,null,null,null,null,null,null,null,"","","","","","",null,0]
[null,null,null,null,null,null,null,null,"","","","","","",null,0]
[null,null,null,null,null,null,null,null,"","","","","","",null,0]
[null,null,null,null,null,null,null,null,"","","","","","",null,0]
[null,null,null,null,null,null,null,null,"","","","","","",null,0]
[null,null,null,null,null,null,null,null,"","","","","","",null,0]
[null,null,null,null,null,null,null,null,"","","","","","",null,0]
[null,null,null,null,null,null,null,null,"","","","","","",null,0]
[null,null,null,null,null,null,null,null,{"$f":"IF(E79>=$K$5,\"\",IF(E79>=$K$6,($D79&\", \"),\"\"))","v":""},{"$f":"IF(E79>=$K$6,\"\",IF(E79>=$K$7,($D79&\", \"),\"\"))","v":""},{"$f":"IF($E79=\"\",\"\",IF($E79<$K$7,$D79&\", \",\"\"))","v":""},{"$f":"IF(H79>=$K$5,\"\",IF(H79>=$K$6,($D79&\", \"),\"\"))","v":""},{"$f":"IF(H79>=$K$6,\"\",IF(H79>=$K$7,($D79&\", \"),\"\"))","v":""},{"$f":"IF($H79=\"\",\"\",IF($H79<$K$7,$D79&\", \",\"\"))","v":""},null,0]
[null,null,null,null,null,null,null,null,"","","","","","",null,{"$f":"IF(H80<>\"\",H80-E80,IF(G80<>\"\",G80-E80,IF(F80<>\"\",F80-E80,IE80)))","v":0}]
[null,null,null,null,null,null,null,null,"","","","","","",null,0]
[null,null,null,null,null,null,null,null,"","","","","","",null,0]
[null,null,null,null,null,null,null,null,"","","","","","",null,0]
[null,null,null,null,null,null,null,null,"","","","","","",null,0]
[null,null,null,null,null,null,null,null,"","","","","","",null,0]
[null,null,null,null,null,null,null,null,"","","","","","",null,0]
[null,null,null,null,null,null,null,null,"","","","","","",null,0]
[null,null,null,null,null,null,null,null,"","","","","","",null,0]
[null,null,null,null,null,null,null,null,"","","","","","",null,0]
[null,null,null,null,null,null,null,null,"","","","","","",null,0]
[null,null,null,null,null,null,null,null,"","","","","","",null,0]
[null,null,null,null,null,null,null,null,"","","","","","",null,0]
[null,null,null,null,null,null,null,null,"","","","","","",null,0]
[null,null,null,null,null,null,null,null,"","","","","","",null,0]
[null,null,null,null,null,null,null,null,"","","","","","",null,0]
[null,null,null,null,null,null,null,null,"","","","","","",null,0]
[null,null,null,null,null,null,null,null,"","","","","","",null,0]
[null,null,null,null,null,null,null,null,"","","","","","",null,0]
[null,null,null,null,null,null,null,null,"","","","","","",null,0]
[null,null,null,null,null,null,null,null,"","","","","","",null,0]
[null,null,null,null,null,null,null,null,"","","","","","",null,0]
[null,null,null,null,null,null,null,null,"","","","","","",null,0]
[null,null,null,null,null,null,null,null,"","","","","","",null,0]
[null,null,null,null,null,null,null,null,"","","","","","",null,0]
[null,null,null,null,null,null,null,null,"","","","","","",null,0]
[null,null,null,null,null,null,null,null,"","","","","","",null,0]
[null,null,null,null,null,null,null,null,"","","","","","",null,0]
[null,null,null,null,null,null,null,null,"","","","","","",null,0]
[null,null,null,null,null,null,null,null,"","","","","","",null,0]
[null,null,null,null,null,null,null,null,"","","","","","",null,0]
[null,null,null,null,null,null,null,null,{"$f":"IF(E111>=$K$5,\"\",IF(E111>=$K$6,($D111&\", \"),\"\"))","v":""},{"$f":"IF(E111>=$K$6,\"\",IF(E111>=$K$7,($D111&\", \"),\"\"))","v":""},{"$f":"IF($E111=\"\",\"\",IF($E111<$K$7,$D111&\", \",\"\"))","v":""},{"$f":"IF(H111>=$K$5,\"\",IF(H111>=$K$6,($D111&\", \"),\"\"))","v":""},{"$f":"IF(H111>=$K$6,\"\",IF(H111>=$K$7,($D111&\", \"),\"\"))","v":""},{"$f":"IF($H111=\"\",\"\",IF($H111<$K$7,$D111&\", \",\"\"))","v":""},null,0]
[null,null,null,null,null,null,null,null,"","","","","","",null,0]
[null,null,null,null,null,null,null,null,"","","","","","",null,0]
[null,null,null,null,null,null,null,null,"","","","","","",null,0]
[null,null,null,null,null,null,null,null,"","","","","","",null,0]
[null,null,null,null,null,null,null,null,"","","","","","",null,0]
[null,null,null,null,null,null,null,null,"","","","","","",null,0]
[null,null,null,null,null,null,null,null,"","","","","","",null,0]
[null,null,null,null,null,null,null,null,"","","","","","",null,0]
[null,null,null,null,null,null,null,null,"","","","","","",null,0]
[null,null,null,null,null,null,null,null,"","","","","","",null,0]
[null,null,null,null,null,null,null,null,"","","","","","",null,0]
[null,null,null,null,null,null,null,null,"","","","","","",null,0]
[null,null,null,null,null,null,null,null,"","","","","","",null,0]
[null,null,null,null,null,null,null,null,"","","","","","",null,0]
[null,null,null,null,null,null,null,null,"","","","","","",null,0]
[null,null,null,null,null,null,null,null,"","","","","","",null,0]
[null,null,null,null,null,null,null,null,"","","","","","",null,0]
[null,null,null,null,null,null,null,null,"","","","","","",null,0]
[null,null,null,null,null,null,null,null,"","","","","","",null,0]
[null,null,null,null,null,null,null,null,"","","","","","",null,0]
[null,null,null,null,null,null,null,null,"","","","","","",null,0]
[null,null,null,null,null,null,null,null,"","","","","","",null,0]
[null,null,null,null,null,null,null,null,"","","","","","",null,0]
[null,null,null,null,null,null,null,null,"","","","","","",null,0]
[null,null,null,null,null,null,null,null,"","","","","","",null,0]
[null,null,null,null,null,null,null,null,"","","","","","",null,0]
[null,null,null,null,null,null,null,null,"","","","","","",null,0]
[null,null,null,null,null,null,null,null,"","","","","","",null,0]
[null,null,null,null,null,null,null,null,"","","","","","",null,0]
[null,null,null,null,null,null,null,null,"","","","","","",null,0]
[null,null,null,null,null,null,null,null,"","","","","","",null,0]
[null,null,null,null,null,null,null,null,{"$f":"IF(E143>=$K$5,\"\",IF(E143>=$K$6,($D143&\", \"),\"\"))","v":""},{"$f":"IF(E143>=$K$6,\"\",IF(E143>=$K$7,($D143&\", \"),\"\"))","v":""},{"$f":"IF($E143=\"\",\"\",IF($E143<$K$7,$D143&\", \",\"\"))","v":""},{"$f":"IF(H143>=$K$5,\"\",IF(H143>=$K$6,($D143&\", \"),\"\"))","v":""},{"$f":"IF(H143>=$K$6,\"\",IF(H143>=$K$7,($D143&\", \"),\"\"))","v":""},{"$f":"IF($H143=\"\",\"\",IF($H143<$K$7,$D143&\", \",\"\"))","v":""},null,0]
[null,null,null,null,null,null,null,null,"","","","","","",null,{"$f":"IF(H144<>\"\",H144-E144,IF(G144<>\"\",G144-E144,IF(F144<>\"\",F144-E144,IE144)))","v":0}]
[null,null,null,null,null,null,null,null,"","","","","","",null,0]
[null,null,null,null,null,null,null,null,"","","","","","",null,0]
[null,null,null,null,null,null,null,null,"","","","","","",null,0]
[null,null,null,null,null,null,null,null,"","","","","","",null,0]
[null,null,null,null,null,null,null,null,"","","","","","",null,0]
[null,null,null,null,null,null,null,null,"","","","","","",null,0]
[null,null,null,null,null,null,null,null,"","","","","","",null,0]
[null,null,null,null,null,null,null,null,"","","","","","",null,0]
[null,null,null,null,null,null,null,null,"","","","","","",null,0]
[null,null,null,null,null,null,null,null,"","","","","","",null,0]
[null,null,null,null,null,null,null,null,"","","","","","",null,0]
[null,null,null,null,null,null,null,null,"","","","","","",null,0]
[null,null,null,null,null,null,null,null,"","","","","","",null,0]
[null,null,null,null,null,null,null,null,"","","","","","",null,0]
[null,null,null,null,null,null,null,null,"","","","","","",null,0]
[null,null,null,null,null,null,null,null,"","","","","","",null,0]
[null,null,null,null,null,null,null,null,"","","","","","",null,0]
[null,null,null,null,null,null,null,null,"","","","","","",null,0]
[null,null,null,null,null,null,null,null,"","","","","","",null,0]
[null,null,null,null,null,null,null,null,"","","","","","",null,0]
[null,null,null,null,null,null,null,null,null,null,null,null,null,null,null,0]
[null,null,null,null,null,null,null,null,null,null,null,null,null,null,null,0]
[null,null,null,null,null,null,null,null,null,null,null,null,null,null,null,0]
[null,null,null,null,null,null,null,null,null,null,null,null,null,null,null,0]
[null,null,null,null,null,null,null,null,null,null,null,null,null,null,null,0]
[null,null,null,null,null,null,null,null,null,null,null,null,null,null,null,0]
[null,null,null,null,null,null,null,null,null,null,null,null,null,null,null,0]
[null,null,null,null,null,null,null,null,null,null,null,null,null,null,null,0]
[null,null,null,null,null,null,null,null,null,null,null,null,null,null,null,0]
[null,null,null,null,null,null,null,null,null,null,null,null,null,null,null,0]
[null,null,null,null,null,null,null,null,null,null,null,null,null,null,null,0]
[null,null,null,null,null,null,null,null,null,null,null,null,null,null,null,0]
[null,null,null,null,null,null,null,null,null,null,null,null,null,null,null,0]
[null,null,null,null,null,null,null,null,null,null,null,null,null,null,null,0]
[null,null,null,null,null,null,null,null,null,null,null,null,null,null,null,0]
[null,null,null,null,null,null,null,null,null,null,null,null,null,null,null,0]
[null,null,null,null,null,null,null,null,null,null,null,null,null,null,null,0]
[null,null,null,null,null,null,null,null,null,null,null,null,null,null,null,0]
[null,null,null,null,null,null,null,null,null,null,null,null,null,null,null,0]
[null,null,null,null,null,null,null,null,null,null,null,null,null,null,null,0]
[null,null,null,null,null,null,null,null,null,null,null,null,null,null,null,0]
[null,null,null,null,null,null,null,null,null,null,null,null,null,null,null,0]
[null,null,null,null,null,null,null,null,null,null,null,null,null,null,null,0]
[null,null,null,null,null,null,null,null,null,null,null,null,null,null,null,0]
[null,null,null,null,null,null,null,null,null,null,null,null,null,null,null,{"$f":"IF(H189<>\"\",H189-E189,IF(G189<>\"\",G189-E189,IF(F189<>\"\",F189-E189,IE189)))","v":0}]

{"sheet":"Tchr3","index":8,"n_rows":189,"n_cols":17,"rows_kept":189,"cut":false,"hidden":false,"merged":[[8,1,8,3],[9,1,9,3],[10,1,10,3],[11,1,11,3],[2,1,2,3],[3,1,3,3],[4,1,4,3],[5,1,5,3],[6,1,6,3],[7,1,7,3]]}
[null,null,null,null,"Teacher:",{"$f":"IF(Cover!D6=\"\",\"\",Cover!D6)","v":""},null,null,null,"Max:",{"$f":"Cover!J12","v":5}]
[null,null,null,null,{"$f":"IF(Cover!L3=\"\",\"\",Cover!L3)","v":""},{"$f":"IF(Cover!L4=\"\",\"\",Cover!L4)","v":""},{"$f":"IF(Cover!L5=\"\",\"\",Cover!L5)","v":""},{"$f":"IF(Cover!L6=\"\",\"\",Cover!L6)","v":""}]
[null,null,null,null,{"$f":"E14","v":"CFA 1 Pre"},{"$f":"F14","v":"CFA 2 Mid"},{"$f":"G14","v":"CFA 3 Post"},{"$f":"H14","v":"CFA 4"},null,null,null,null,null,null,null,"Change"]
[null,"Total Taking:",null,null,{"$f":"COUNT(E15:E189)","v":0},{"$f":"COUNT(F15:F189)","v":0},{"$f":"COUNT(G15:G189)","v":0},{"$f":"COUNT(H15:H189)","v":0},null,"MinExceed:",null,null,null,null,null,{"$f":"IF(H4>0,H4-E4,IF(G4>0,G4-E4,IF(F4>0,F4-E4,IE4)))","v":0}]
[null,{"$f":"\"Number \"&Cover!$K$13&\"  (>=\" & Cover!$J$13 & \")\"","v":"Number PROFICIENT  (>=4)"},null,null,{"$f":"COUNTIF(E15:E189,\">=\"&K5)","v":0},{"$f":"COUNTIF(F15:F189,\">=\"&K5)","v":0},{"$f":"COUNTIF(G15:G189,\">=\"&K5)","v":0},{"$f":"COUNTIF(H15:H189,\">=\"&K5)","v":0},null,"MinProf:",{"$f":"Cover!J13","v":4},null,null,null,null,0]
[null,{"$f":"\"Percent \"&Cover!$K$13&\"  (>=\" & Cover!$J$13 & \")\"","v":"Percent PROFICIENT  (>=4)"},null,null,{"$f":"IF(E4=0,0,E5/E4)","v":0},{"$f":"IF(F4=0,0,F5/F4)","v":0},{"$f":"IF(G4=0,0,G5/G4)","v":0},0,null,"Close:",{"$f":"Cover!J14","v":3},null,null,null,null,0]
[null,{"$f":"\"Number \"&Cover!$K$14&\" (Between \" & Cover!$J$14 & \" & \" & Cover!$J$13-1 & \")\"","v":"Number CLOSE TO (Between 3 & 3)"},null,null,{"$f":"COUNTIF(E$15:E$189,\">=\"&$K$6)-COUNTIF(E$15:E$189,\">=\"&$K$5)","v":0},{"$f":"COUNTIF(F$15:F$189,\">=\"&$K$6)-COUNTIF(F$15:F$189,\">=\"&$K$5)","v":0},{"$f":"COUNTIF(G$15:G$189,\">=\"&$K$6)-COUNTIF(G$15:G$189,\">=\"&$K$5)","v":0},{"$f":"COUNTIF(H$15:H$189,\">=\"&$K$6)-COUNTIF(H$15:H$189,\">=\"&$K$5)","v":0},null,"Far to Go:",{"$f":"Cover!J15","v":2},null,null,null,null,0]
[null,{"$f":"\"Percent \"&Cover!$K$14&\" (Between \" & Cover!$J$14 & \" & \" & Cover!$J$13-1 & \")\"","v":"Percent CLOSE TO (Between 3 & 3)"},null,null,{"$f":"IF(E4=0,0,E7/E4)","v":0},{"$f":"IF(F4=0,0,F7/F4)","v":0},{"$f":"IF(G4=0,0,G7/G4)","v":0},0,null,null,null,null,null,null,null,0]
[null,{"$f":"\"Number \"&Cover!$K$15&\" (Between \" & Cover!$J$15 & \" & \" & Cover!$J$14-1 & \")\"","v":"Number PROGRESSING (Between 2 & 2)"},null,null,{"$f":"COUNTIF(E$15:E$189,\">=\"&$K$7)-COUNTIF(E$15:E$189,\">=\"&$K$6)","v":0},{"$f":"COUNTIF(F$15:F$189,\">=\"&$K$7)-COUNTIF(F$15:F$189,\">=\"&$K$6)","v":0},{"$f":"COUNTIF(G$15:G$189,\">=\"&$K$7)-COUNTIF(G$15:G$189,\">=\"&$K$6)","v":0},0,null,null,null,null,null,null,null,0]
[null,{"$f":"\"Percent \"&Cover!$K$15&\" (Between \" & Cover!$J$15 & \" & \" & Cover!$J$14-1 & \")\"","v":"Percent PROGRESSING (Between 2 & 2)"},null,null,{"$f":"IF(E4=0,0,E9/E4)","v":0},{"$f":"IF(F4=0,0,F9/F4)","v":0},{"$f":"IF(G4=0,0,G9/G4)","v":0},0,null,null,null,null,null,null,null,0]
[null,{"$f":"\"Number \"&Cover!$K$16&\" (Between \" & Cover!$J$16 & \" & \" & Cover!$J$15-1 & \")\"","v":"Number NEEDS PRACTICE (Between 1 & 1)"},null,null,{"$f":"COUNTIF(E$15:E$189,\"<\"&$K$7)","v":0},{"$f":"COUNTIF(F$15:F$189,\"<\"&$K$7)","v":0},{"$f":"COUNTIF(G$15:G$189,\"<\"&$K$7)","v":0},0,null,null,null,null,null,null,null,0]
[null,{"$f":"\"Percent \"&Cover!$K$16&\" (Between \" & Cover!$J$16 & \" & \" & Cover!$J$15-1 & \")\"","v":"Percent NEEDS PRACTICE (Between 1 & 1)"},null,null,{"$f":"IF(E4=0,0,E11/E4)","v":0},{"$f":"IF(F4=0,0,F11/F4)","v":0},{"$f":"IF(G4=0,0,G11/G4)","v":0},0,{"$f":"CONCATENATE(I15,I16,I17,I18,I19,I20,I21,I22,I23,I24,I25,I26,I27,I28,I29,I30,I31,I32,I33,I34,I35,I36,I37,I38,I39,I40,I41,I42,I43,I44,I45,I46,I47,I48,I49,I50,I51,I52,I53,I54,I55,I56,I57,I58,I59,I60,I61,I62,I63,I64,I65,I66,I67,I68,I69,I70,I71,I72,I73,I74,I75,I76,I77,I78,I79,I80,I81,I82,I83,I84,I85,I86,I87,I88,I89,I90,I91,I92,I93,I94,I95,I96,I97,I98,I99,I100,I101,I102,I103,I104,I105,I106,I107,I108,I109,I110,I111,I112,I113,I114,I115,I116,I117,I118,I119,I120,I121,I122,I123,I124,I125,I126,I127,I128,I129,I130,I131,I132,I133,I134,I135,I136,I137,I138,I139,I140,I141,I142,I143,I144,I145,I146,I147,I148,I149,I150,I151,I152,I153,I154,I155,I156,I157,I158,I159,I160,I161,I162,I163,I164)","v":""},{"$f":"CONCATENATE(J15,J16,J17,J18,J19,J20,J21,J22,J23,J24,J25,J26,J27,J28,J29,J30,J31,J32,J33,J34,J35,J36,J37,J38,J39,J40,J41,J42,J43,J44,J45,J46,J47,J48,J49,J50,J51,J52,J53,J54,J55,J56,J57,J58,J59,J60,J61,J62,J63,J64,J65,J66,J67,J68,J69,J70,J71,J72,J73,J74,J75,J76,J77,J78,J79,J80,J81,J82,J83,J84,J85,J86,J87,J88,J89,J90,J91,J92,J93,J94,J95,J96,J97,J98,J99,J100,J101,J102,J103,J104,J105,J106,J107,J108,J109,J110,J111,J112,J113,J114,J115,J116,J117,J118,J119,J120,J121,J122,J123,J124,J125,J126,J127,J128,J129,J130,J131,J132,J133,J134,J135,J136,J137,J138,J139,J140,J141,J142,J143,J144,J145,J146,J147,J148,J149,J150,J151,J152,J153,J154,J155,J156,J157,J158,J159,J160,J161,J162,J163,J164)","v":""},"","","","",null,0]
[]
[null,"Period","Student Number","Student Name",{"$f":"IF(Cover!J3=\"\",\"\",Cover!J3)","v":"CFA 1 Pre"},{"$f":"IF(Cover!J4=\"\",\"\",Cover!J4)","v":"CFA 2 Mid"},{"$f":"IF(Cover!J5=\"\",\"\",Cover!J5)","v":"CFA 3 Post"},{"$f":"IF(Cover!J6=\"\",\"\",Cover!J6)","v":"CFA 4"},"Pre Close","Pre Far Likely","Pre Extensive","Post Close","Post Far to Go ","Post Extensive",null,"Growth","Return to Cover"]
[null,null,null,null,null,null,null,null,{"$f":"IF(E15>=$K$5,\"\",IF(E15>=$K$6,($D15&\", \"),\"\"))","v":""},{"$f":"IF(E15>=$K$6,\"\",IF(E15>=$K$7,($D15&\", \"),\"\"))","v":""},{"$f":"IF($E15=\"\",\"\",IF($E15<$K$7,$D15&\", \",\"\"))","v":""},{"$f":"IF(H15>=$K$5,\"\",IF(H15>=$K$6,($D15&\", \"),\"\"))","v":""},{"$f":"IF(H15>=$K$6,\"\",IF(H15>=$K$7,($D15&\", \"),\"\"))","v":""},{"$f":"IF($H15=\"\",\"\",IF($H15<$K$7,$D15&\", \",\"\"))","v":""},null,{"$f":"IF(H15<>\"\",H15-E15,IF(G15<>\"\",G15-E15,IF(F15<>\"\",F15-E15,IE15)))","v":0}]
[null,null,null,null,null,null,null,null,{"$f":"IF(E16>=$K$5,\"\",IF(E16>=$K$6,($D16&\", \"),\"\"))","v":""},"",{"$f":"IF($E16=\"\",\"\",IF($E16<$K$7,$D16&\", \",\"\"))","v":""},"","","",null,{"$f":"IF(H16<>\"\",H16-E16,IF(G16<>\"\",G16-E16,IF(F16<>\"\",F16-E16,IE16)))","v":0}]
[null,null,null,null,null,null,null,null,"","","","","","",null,0]
[null,null,null,null,null,null,null,null,"","","","","","",null,0]
[null,null,null,null,null,null,null,null,"","","","","","",null,0]
[null,null,null,null,null,null,null,null,"","","","","","",null,0]
[null,null,null,null,null,null,null,null,"","","","","","",null,0]
[null,null,null,null,null,null,null,null,"","","","","","",null,0]
[null,null,null,null,null,null,null,null,"","","","","","",null,0]
[null,null,null,null,null,null,null,null,"","","","","","",null,0]
[null,null,null,null,null,null,null,null,"","","","","","",null,0]
[null,null,null,null,null,null,null,null,"","","","","","",null,0]
[null,null,null,null,null,null,null,null,"","","","","","",null,0]
[null,null,null,null,null,null,null,null,"","","","","","",null,0]
[null,null,null,null,null,null,null,null,"","","","","","",null,0]
[null,null,null,null,null,null,null,null,"","","","","","",null,0]
[null,null,null,null,null,null,null,null,"","","","","","",null,0]
[null,null,null,null,null,null,null,null,"","","","","","",null,0]
[null,null,null,null,null,null,null,null,"","","","","","",null,0]
[null,null,null,null,null,null,null,null,"","","","","","",null,0]
[null,null,null,null,null,null,null,null,"","","","","","",null,0]
[null,null,null,null,null,null,null,null,"","","","","","",null,0]
[null,null,null,null,null,null,null,null,"","","","","","",null,0]
[null,null,null,null,null,null,null,null,"","","","","","",null,0]
[null,null,null,null,null,null,null,null,"","","","","","",null,0]
[null,null,null,null,null,null,null,null,"","","","","","",null,0]
[null,null,null,null,null,null,null,null,"","","","","","",null,0]
[null,null,null,null,null,null,null,null,"","","","","","",null,0]
[null,null,null,null,null,null,null,null,"","","","","","",null,0]
[null,null,null,null,null,null,null,null,"","","","","","",null,0]
[null,null,null,null,null,null,null,null,"","","","","","",null,0]
[null,null,null,null,null,null,null,null,"","","","","","",null,0]
[null,null,null,null,null,null,null,null,"","","",{"$f":"IF(H47>=$K$5,\"\",IF(H47>=$K$6,($D47&\", \"),\"\"))","v":""},{"$f":"IF(H47>=$K$6,\"\",IF(H47>=$K$7,($D47&\", \"),\"\"))","v":""},{"$f":"IF($H47=\"\",\"\",IF($H47<$K$7,$D47&\", \",\"\"))","v":""},null,0]
[null,null,null,null,null,null,null,null,"","","","","","",null,0]
[null,null,null,null,null,null,null,null,"","","","","","",null,0]
[null,null,null,null,null,null,null,null,"","","","","","",null,0]
[null,null,null,null,null,null,null,null,"","","","","","",null,0]
[null,null,null,null,null,null,null,null,"","","","","","",null,0]
[null,null,null,null,null,null,null,null,"","","","","","",null,0]
[null,null,null,null,null,null,null,null,"","","","","","",null,0]
[null,null,null,null,null,null,null,null,"","","","","","",null,0]
[null,null,null,null,null,null,null,null,"","","","","","",null,0]
[null,null,null,null,null,null,null,null,"","","","","","",null,0]
[null,null,null,null,null,null,null,null,"","","","","","",null,0]
[null,null,null,null,null,null,null,null,"","","","","","",null,0]
[null,null,null,null,null,null,null,null,"","","","","","",null,0]
[null,null,null,null,null,null,null,null,"","","","","","",null,0]
[null,null,null,null,null,null,null,null,"","","","","","",null,0]
[null,null,null,null,null,null,null,null,"","","","","","",null,0]
[null,null,null,null,null,null,null,null,"","","","","","",null,0]
[null,null,null,null,null,null,null,null,"","","","","","",null,0]
[null,null,null,null,null,null,null,null,"","","","","","",null,0]
[null,null,null,null,null,null,null,null,"","","","","","",null,0]
[null,null,null,null,null,null,null,null,"","","","","","",null,0]
[null,null,null,null,null,null,null,null,"","","","","","",null,0]
[null,null,null,null,null,null,null,null,"","","","","","",null,0]
[null,null,null,null,null,null,null,null,"","","","","","",null,0]
[null,null,null,null,null,null,null,null,"","","","","","",null,0]
[null,null,null,null,null,null,null,null,"","","","","","",null,0]
[null,null,null,null,null,null,null,null,"","","","","","",null,0]
[null,null,null,null,null,null,null,null,"","","","","","",null,0]
[null,null,null,null,null,null,null,null,"","","","","","",null,0]
[null,null,null,null,null,null,null,null,"","","","","","",null,0]
[null,null,null,null,null,null,null,null,"","","","","","",null,0]
[null,null,null,null,null,null,null,null,"",{"$f":"IF(E79>=$K$6,\"\",IF(E79>=$K$7,($D79&\", \"),\"\"))","v":""},"",{"$f":"IF(H79>=$K$5,\"\",IF(H79>=$K$6,($D79&\", \"),\"\"))","v":""},{"$f":"IF(H79>=$K$6,\"\",IF(H79>=$K$7,($D79&\", \"),\"\"))","v":""},{"$f":"IF($H79=\"\",\"\",IF($H79<$K$7,$D79&\", \",\"\"))","v":""},null,0]
[null,null,null,null,null,null,null,null,{"$f":"IF(E80>=$K$5,\"\",IF(E80>=$K$6,($D80&\", \"),\"\"))","v":""},"",{"$f":"IF($E80=\"\",\"\",IF($E80<$K$7,$D80&\", \",\"\"))","v":""},"","","",null,{"$f":"IF(H80<>\"\",H80-E80,IF(G80<>\"\",G80-E80,IF(F80<>\"\",F80-E80,IE80)))","v":0}]
[null,null,null,null,null,null,null,null,"","","","","","",null,0]
[null,null,null,null,null,null,null,null,"","","","","","",null,0]
[null,null,null,null,null,null,null,null,"","","","","","",null,0]
[null,null,null,null,null,null,null,null,"","","","","","",null,0]
[null,null,null,null,null,null,null,null,"","","","","","",null,0]
[null,null,null,null,null,null,null,null,"","","","","","",null,0]
[null,null,null,null,null,null,null,null,"","","","","","",null,0]
[null,null,null,null,null,null,null,null,"","","","","","",null,0]
[null,null,null,null,null,null,null,null,"","","","","","",null,0]
[null,null,null,null,null,null,null,null,"","","","","","",null,0]
[null,null,null,null,null,null,null,null,"","","","","","",null,0]
[null,null,null,null,null,null,null,null,"","","","","","",null,0]
[null,null,null,null,null,null,null,null,"","","","","","",null,0]
[null,null,null,null,null,null,null,null,"","","","","","",null,0]
[null,null,null,null,null,null,null,null,"","","","","","",null,0]
[null,null,null,null,null,null,null,null,"","","","","","",null,0]
[null,null,null,null,null,null,null,null,"","","","","","",null,0]
[null,null,null,null,null,null,null,null,"","","","","","",null,0]
[null,null,null,null,null,null,null,null,"","","","","","",null,0]
[null,null,null,null,null,null,null,null,"","","","","","",null,0]
[null,null,null,null,null,null,null,null,"","","","","","",null,0]
[null,null,null,null,null,null,null,null,"","","","","","",null,0]
[null,null,null,null,null,null,null,null,"","","","","","",null,0]
[null,null,null,null,null,null,null,null,"","","","","","",null,0]
[null,null,null,null,null,null,null,null,"","","","","","",null,0]
[null,null,null,null,null,null,null,null,"","","","","","",null,0]
[null,null,null,null,null,null,null,null,"","","","","","",null,0]
[null,null,null,null,null,null,null,null,"","","","","","",null,0]
[null,null,null,null,null,null,null,null,"","","","","","",null,0]
[null,null,null,null,null,null,null,null,"","","","","","",null,0]
[null,null,null,null,null,null,null,null,"","","",{"$f":"IF(H111>=$K$5,\"\",IF(H111>=$K$6,($D111&\", \"),\"\"))","v":""},{"$f":"IF(H111>=$K$6,\"\",IF(H111>=$K$7,($D111&\", \"),\"\"))","v":""},{"$f":"IF($H111=\"\",\"\",IF($H111<$K$7,$D111&\", \",\"\"))","v":""},null,0]
[null,null,null,null,null,null,null,null,"","","","","","",null,0]
[null,null,null,null,null,null,null,null,"","","","","","",null,0]
[null,null,null,null,null,null,null,null,"","","","","","",null,0]
[null,null,null,null,null,null,null,null,"","","","","","",null,0]
[null,null,null,null,null,null,null,null,"","","","","","",null,0]
[null,null,null,null,null,null,null,null,"","","","","","",null,0]
[null,null,null,null,null,null,null,null,"","","","","","",null,0]
[null,null,null,null,null,null,null,null,"","","","","","",null,0]
[null,null,null,null,null,null,null,null,"","","","","","",null,0]
[null,null,null,null,null,null,null,null,"","","","","","",null,0]
[null,null,null,null,null,null,null,null,"","","","","","",null,0]
[null,null,null,null,null,null,null,null,"","","","","","",null,0]
[null,null,null,null,null,null,null,null,"","","","","","",null,0]
[null,null,null,null,null,null,null,null,"","","","","","",null,0]
[null,null,null,null,null,null,null,null,"","","","","","",null,0]
[null,null,null,null,null,null,null,null,"","","","","","",null,0]
[null,null,null,null,null,null,null,null,"","","","","","",null,0]
[null,null,null,null,null,null,null,null,"","","","","","",null,0]
[null,null,null,null,null,null,null,null,"","","","","","",null,0]
[null,null,null,null,null,null,null,null,"","","","","","",null,0]
[null,null,null,null,null,null,null,null,"","","","","","",null,0]
[null,null,null,null,null,null,null,null,"","","","","","",null,0]
[null,null,null,null,null,null,null,null,"","","","","","",null,0]
[null,null,null,null,null,null,null,null,"","","","","","",null,0]
[null,null,null,null,null,null,null,null,"","","","","","",null,0]
[null,null,null,null,null,null,null,null,"","","","","","",null,0]
[null,null,null,null,null,null,null,null,"","","","","","",null,0]
[null,null,null,null,null,null,null,null,"","","","","","",null,0]
[null,null,null,null,null,null,null,null,"","","","","","",null,0]
[null,null,null,null,null,null,null,null,"","","","","","",null,0]
[null,null,null,null,null,null,null,null,"","","","","","",null,0]
[null,null,null,null,null,null,null,null,"",{"$f":"IF(E143>=$K$6,\"\",IF(E143>=$K$7,($D143&\", \"),\"\"))","v":""},"",{"$f":"IF(H143>=$K$5,\"\",IF(H143>=$K$6,($D143&\", \"),\"\"))","v":""},{"$f":"IF(H143>=$K$6,\"\",IF(H143>=$K$7,($D143&\", \"),\"\"))","v":""},{"$f":"IF($H143=\"\",\"\",IF($H143<$K$7,$D143&\", \",\"\"))","v":""},null,0]
[null,null,null,null,null,null,null,null,{"$f":"IF(E144>=$K$5,\"\",IF(E144>=$K$6,($D144&\", \"),\"\"))","v":""},"",{"$f":"IF($E144=\"\",\"\",IF($E144<$K$7,$D144&\", \",\"\"))","v":""},"","","",null,{"$f":"IF(H144<>\"\",H144-E144,IF(G144<>\"\",G144-E144,IF(F144<>\"\",F144-E144,IE144)))","v":0}]
[null,null,null,null,null,null,null,null,"","","","","","",null,0]
[null,null,null,null,null,null,null,null,"","","","","","",null,0]
[null,null,null,null,null,null,null,null,"","","","","","",null,0]
[null,null,null,null,null,null,null,null,"","","","","","",null,0]
[null,null,null,null,null,null,null,null,"","","","","","",null,0]
[null,null,null,null,null,null,null,null,"","","","","","",null,0]
[null,null,null,null,null,null,null,null,"","","","","","",null,0]
[null,null,null,null,null,null,null,null,"","","","","","",null,0]
[null,null,null,null,null,null,null,null,"","","","","","",null,0]
[null,null,null,null,null,null,null,null,"","","","","","",null,0]
[null,null,null,null,null,null,null,null,"","","","","","",null,0]
[null,null,null,null,null,null,null,null,"","","","","","",null,0]
[null,null,null,null,null,null,null,null,"","","","","","",null,0]
[null,null,null,null,null,null,null,null,"","","","","","",null,0]
[null,null,null,null,null,null,null,null,"","","","","","",null,0]
[null,null,null,null,null,null,null,null,"","","","","","",null,0]
[null,null,null,null,null,null,null,null,"","","","","","",null,0]
[null,null,null,null,null,null,null,null,"","","","","","",null,0]
[null,null,null,null,null,null,null,null,"","","","","","",null,0]
[null,null,null,null,null,null,null,null,"","","","","","",null,0]
[null,null,null,null,null,null,null,null,null,null,null,null,null,null,null,0]
[null,null,null,null,null,null,null,null,null,null,null,null,null,null,null,0]
[null,null,null,null,null,null,null,null,null,null,null,null,null,null,null,0]
[null,null,null,null,null,null,null,null,null,null,null,null,null,null,null,0]
[null,null,null,null,null,null,null,null,null,null,null,null,null,null,null,0]
[null,null,null,null,null,null,null,null,null,null,null,null,null,null,null,0]
[null,null,null,null,null,null,null,null,null,null,null,null,null,null,null,0]
[null,null,null,null,null,null,null,null,null,null,null,null,null,null,null,0]
[null,null,null,null,null,null,null,null,null,null,null,null,null,null,null,0]
[null,null,null,null,null,null,null,null,null,null,null,null,null,null,null,0]
[null,null,null,null,null,null,null,null,null,null,null,null,null,null,null,0]
[null,null,null,null,null,null,null,null,null,null,null,null,null,null,null,0]
[null,null,null,null,null,null,null,null,null,null,null,null,null,null,null,0]
[null,null,null,null,null,null,null,null,null,null,null,null,null,null,null,0]
[null,null,null,null,null,null,null,null,null,null,null,null,null,null,null,0]
[null,null,null,null,null,null,null,null,null,null,null,null,null,null,null,0]
[null,null,null,null,null,null,null,null,null,null,null,null,null,null,null,0]
[null,null,null,null,null,null,null,null,null,null,null,null,null,null,null,0]
[null,null,null,null,null,null,null,null,null,null,null,null,null,null,null,0]
[null,null,null,null,null,null,null,null,null,null,null,null,null,null,null,0]
[null,null,null,null,null,null,null,null,null,null,null,null,null,null,null,0]
[null,null,null,null,null,null,null,null,null,null,null,null,null,null,null,0]
[null,null,null,null,null,null,null,null,null,null,null,null,null,null,null,0]
[null,null,null,null,null,null,null,null,null,null,null,null,null,null,null,0]
[null,null,null,null,null,null,null,null,null,null,null,null,null,null,null,{"$f":"IF(H189<>\"\",H189-E189,IF(G189<>\"\",G189-E189,IF(F189<>\"\",F189-E189,IE189)))","v":0}]

{"sheet":"Tchr4","index":9,"n_rows":189,"n_cols":17,"rows_kept":189,"cut":false,"hidden":false,"merged":[[8,1,8,3],[9,1,9,3],[10,1,10,3],[11,1,11,3],[2,1,2,3],[3,1,3,3],[4,1,4,3],[5,1,5,3],[6,1,6,3],[7,1,7,3]]}
[null,null,null,null,"Teacher:",{"$f":"IF(Cover!D7=\"\",\"\",Cover!D7)","v":""},null,null,null,"Max:",{"$f":"Cover!J12","v":5}]
[null,null,null,null,{"$f":"IF(Cover!L3=\"\",\"\",Cover!L3)","v":""},{"$f":"IF(Cover!L4=\"\",\"\",Cover!L4)","v":""},{"$f":"IF(Cover!L5=\"\",\"\",Cover!L5)","v":""},{"$f":"IF(Cover!L6=\"\",\"\",Cover!L6)","v":""}]
[null,null,null,null,{"$f":"E14","v":"CFA 1 Pre"},{"$f":"F14","v":"CFA 2 Mid"},{"$f":"G14","v":"CFA 3 Post"},{"$f":"H14","v":"CFA 4"},null,null,null,null,null,null,null,"Change"]
[null,"Total Taking:",null,null,{"$f":"COUNT(E15:E189)","v":0},{"$f":"COUNT(F15:F189)","v":0},{"$f":"COUNT(G15:G189)","v":0},{"$f":"COUNT(H15:H189)","v":0},null,"MinExceed:",null,null,null,null,null,{"$f":"IF(H4>0,H4-E4,IF(G4>0,G4-E4,IF(F4>0,F4-E4,IE4)))","v":0}]
[null,{"$f":"\"Number \"&Cover!$K$13&\"  (>=\" & Cover!$J$13 & \")\"","v":"Number PROFICIENT  (>=4)"},null,null,{"$f":"COUNTIF(E15:E189,\">=\"&K5)","v":0},{"$f":"COUNTIF(F15:F189,\">=\"&K5)","v":0},{"$f":"COUNTIF(G15:G189,\">=\"&K5)","v":0},{"$f":"COUNTIF(H15:H189,\">=\"&K5)","v":0},null,"MinProf:",{"$f":"Cover!J13","v":4},null,null,null,null,0]
[null,{"$f":"\"Percent \"&Cover!$K$13&\"  (>=\" & Cover!$J$13 & \")\"","v":"Percent PROFICIENT  (>=4)"},null,null,{"$f":"IF(E4=0,0,E5/E4)","v":0},{"$f":"IF(F4=0,0,F5/F4)","v":0},{"$f":"IF(G4=0,0,G5/G4)","v":0},0,null,"Close:",{"$f":"Cover!J14","v":3},null,null,null,null,0]
[null,{"$f":"\"Number \"&Cover!$K$14&\" (Between \" & Cover!$J$14 & \" & \" & Cover!$J$13-1 & \")\"","v":"Number CLOSE TO (Between 3 & 3)"},null,null,{"$f":"COUNTIF(E$15:E$189,\">=\"&$K$6)-COUNTIF(E$15:E$189,\">=\"&$K$5)","v":0},{"$f":"COUNTIF(F$15:F$189,\">=\"&$K$6)-COUNTIF(F$15:F$189,\">=\"&$K$5)","v":0},{"$f":"COUNTIF(G$15:G$189,\">=\"&$K$6)-COUNTIF(G$15:G$189,\">=\"&$K$5)","v":0},{"$f":"COUNTIF(H$15:H$189,\">=\"&$K$6)-COUNTIF(H$15:H$189,\">=\"&$K$5)","v":0},null,"Far to Go:",{"$f":"Cover!J15","v":2},null,null,null,null,0]
[null,{"$f":"\"Percent \"&Cover!$K$14&\" (Between \" & Cover!$J$14 & \" & \" & Cover!$J$13-1 & \")\"","v":"Percent CLOSE TO (Between 3 & 3)"},null,null,{"$f":"IF(E4=0,0,E7/E4)","v":0},{"$f":"IF(F4=0,0,F7/F4)","v":0},{"$f":"IF(G4=0,0,G7/G4)","v":0},0,null,null,null,null,null,null,null,0]
[null,{"$f":"\"Number \"&Cover!$K$15&\" (Between \" & Cover!$J$15 & \" & \" & Cover!$J$14-1 & \")\"","v":"Number PROGRESSING (Between 2 & 2)"},null,null,{"$f":"COUNTIF(E$15:E$189,\">=\"&$K$7)-COUNTIF(E$15:E$189,\">=\"&$K$6)","v":0},{"$f":"COUNTIF(F$15:F$189,\">=\"&$K$7)-COUNTIF(F$15:F$189,\">=\"&$K$6)","v":0},{"$f":"COUNTIF(G$15:G$189,\">=\"&$K$7)-COUNTIF(G$15:G$189,\">=\"&$K$6)","v":0},0,null,null,null,null,null,null,null,0]
[null,{"$f":"\"Percent \"&Cover!$K$15&\" (Between \" & Cover!$J$15 & \" & \" & Cover!$J$14-1 & \")\"","v":"Percent PROGRESSING (Between 2 & 2)"},null,null,{"$f":"IF(E4=0,0,E9/E4)","v":0},{"$f":"IF(F4=0,0,F9/F4)","v":0},{"$f":"IF(G4=0,0,G9/G4)","v":0},0,null,null,null,null,null,null,null,0]
[null,{"$f":"\"Number \"&Cover!$K$16&\" (Between \" & Cover!$J$16 & \" & \" & Cover!$J$15-1 & \")\"","v":"Number NEEDS PRACTICE (Between 1 & 1)"},null,null,{"$f":"COUNTIF(E$15:E$189,\"<\"&$K$7)","v":0},{"$f":"COUNTIF(F$15:F$189,\"<\"&$K$7)","v":0},{"$f":"COUNTIF(G$15:G$189,\"<\"&$K$7)","v":0},0,null,null,null,null,null,null,null,0]
[null,{"$f":"\"Percent \"&Cover!$K$16&\" (Between \" & Cover!$J$16 & \" & \" & Cover!$J$15-1 & \")\"","v":"Percent NEEDS PRACTICE (Between 1 & 1)"},null,null,{"$f":"IF(E4=0,0,E11/E4)","v":0},{"$f":"IF(F4=0,0,F11/F4)","v":0},{"$f":"IF(G4=0,0,G11/G4)","v":0},0,{"$f":"CONCATENATE(I15,I16,I17,I18,I19,I20,I21,I22,I23,I24,I25,I26,I27,I28,I29,I30,I31,I32,I33,I34,I35,I36,I37,I38,I39,I40,I41,I42,I43,I44,I45,I46,I47,I48,I49,I50,I51,I52,I53,I54,I55,I56,I57,I58,I59,I60,I61,I62,I63,I64,I65,I66,I67,I68,I69,I70,I71,I72,I73,I74,I75,I76,I77,I78,I79,I80,I81,I82,I83,I84,I85,I86,I87,I88,I89,I90,I91,I92,I93,I94,I95,I96,I97,I98,I99,I100,I101,I102,I103,I104,I105,I106,I107,I108,I109,I110,I111,I112,I113,I114,I115,I116,I117,I118,I119,I120,I121,I122,I123,I124,I125,I126,I127,I128,I129,I130,I131,I132,I133,I134,I135,I136,I137,I138,I139,I140,I141,I142,I143,I144,I145,I146,I147,I148,I149,I150,I151,I152,I153,I154,I155,I156,I157,I158,I159,I160,I161,I162,I163,I164)","v":""},{"$f":"CONCATENATE(J15,J16,J17,J18,J19,J20,J21,J22,J23,J24,J25,J26,J27,J28,J29,J30,J31,J32,J33,J34,J35,J36,J37,J38,J39,J40,J41,J42,J43,J44,J45,J46,J47,J48,J49,J50,J51,J52,J53,J54,J55,J56,J57,J58,J59,J60,J61,J62,J63,J64,J65,J66,J67,J68,J69,J70,J71,J72,J73,J74,J75,J76,J77,J78,J79,J80,J81,J82,J83,J84,J85,J86,J87,J88,J89,J90,J91,J92,J93,J94,J95,J96,J97,J98,J99,J100,J101,J102,J103,J104,J105,J106,J107,J108,J109,J110,J111,J112,J113,J114,J115,J116,J117,J118,J119,J120,J121,J122,J123,J124,J125,J126,J127,J128,J129,J130,J131,J132,J133,J134,J135,J136,J137,J138,J139,J140,J141,J142,J143,J144,J145,J146,J147,J148,J149,J150,J151,J152,J153,J154,J155,J156,J157,J158,J159,J160,J161,J162,J163,J164)","v":""},"","","","",null,0]
[]
[null,"Period","Student Number","Student Name",{"$f":"IF(Cover!J3=\"\",\"\",Cover!J3)","v":"CFA 1 Pre"},{"$f":"IF(Cover!J4=\"\",\"\",Cover!J4)","v":"CFA 2 Mid"},{"$f":"IF(Cover!J5=\"\",\"\",Cover!J5)","v":"CFA 3 Post"},{"$f":"IF(Cover!J6=\"\",\"\",Cover!J6)","v":"CFA 4"},"Pre Close","Pre Far Likely","Pre Extensive","Post Close","Post Far to Go ","Post Extensive",null,"Growth","Return to Cover"]
[null,null,null,null,null,null,null,null,{"$f":"IF(E15>=$K$5,\"\",IF(E15>=$K$6,($D15&\", \"),\"\"))","v":""},{"$f":"IF(E15>=$K$6,\"\",IF(E15>=$K$7,($D15&\", \"),\"\"))","v":""},{"$f":"IF($E15=\"\",\"\",IF($E15<$K$7,$D15&\", \",\"\"))","v":""},{"$f":"IF(H15>=$K$5,\"\",IF(H15>=$K$6,($D15&\", \"),\"\"))","v":""},{"$f":"IF(H15>=$K$6,\"\",IF(H15>=$K$7,($D15&\", \"),\"\"))","v":""},{"$f":"IF($H15=\"\",\"\",IF($H15<$K$7,$D15&\", \",\"\"))","v":""},null,{"$f":"IF(H15<>\"\",H15-E15,IF(G15<>\"\",G15-E15,IF(F15<>\"\",F15-E15,IE15)))","v":0}]
[null,null,null,null,null,null,null,null,{"$f":"IF(E16>=$K$5,\"\",IF(E16>=$K$6,($D16&\", \"),\"\"))","v":""},"",{"$f":"IF($E16=\"\",\"\",IF($E16<$K$7,$D16&\", \",\"\"))","v":""},"","","",null,{"$f":"IF(H16<>\"\",H16-E16,IF(G16<>\"\",G16-E16,IF(F16<>\"\",F16-E16,IE16)))","v":0}]
[null,null,null,null,null,null,null,null,"","","","","","",null,0]
[null,null,null,null,null,null,null,null,"","","","","","",null,0]
[null,null,null,null,null,null,null,null,"","","","","","",null,0]
[null,null,null,null,null,null,null,null,"","","","","","",null,0]
[null,null,null,null,null,null,null,null,"","","","","","",null,0]
[null,null,null,null,null,null,null,null,"","","","","","",null,0]
[null,null,null,null,null,null,null,null,"","","","","","",null,0]
[null,null,null,null,null,null,null,null,"","","","","","",null,0]
[null,null,null,null,null,null,null,null,"","","","","","",null,0]
[null,null,null,null,null,null,null,null,"","","","","","",null,0]
[null,null,null,null,null,null,null,null,"","","","","","",null,0]
[null,null,null,null,null,null,null,null,"","","","","","",null,0]
[null,null,null,null,null,null,null,null,"","","","","","",null,0]
[null,null,null,null,null,null,null,null,"","","","","","",null,0]
[null,null,null,null,null,null,null,null,"","","","","","",null,0]
[null,null,null,null,null,null,null,null,"","","","","","",null,0]
[null,null,null,null,null,null,null,null,"","","","","","",null,0]
[null,null,null,null,null,null,null,null,"","","","","","",null,0]
[null,null,null,null,null,null,null,null,"","","","","","",null,0]
[null,null,null,null,null,null,null,null,"","","","","","",null,0]
[null,null,null,null,null,null,null,null,"","","","","","",null,0]
[null,null,null,null,null,null,null,null,"","","","","","",null,0]
[null,null,null,null,null,null,null,null,"","","","","","",null,0]
[null,null,null,null,null,null,null,null,"","","","","","",null,0]
[null,null,null,null,null,null,null,null,"","","","","","",null,0]
[null,null,null,null,null,null,null,null,"","","","","","",null,0]
[null,null,null,null,null,null,null,null,"","","","","","",null,0]
[null,null,null,null,null,null,null,null,"","","","","","",null,0]
[null,null,null,null,null,null,null,null,"","","","","","",null,0]
[null,null,null,null,null,null,null,null,"","","","","","",null,0]
[null,null,null,null,null,null,null,null,"","","",{"$f":"IF(H47>=$K$5,\"\",IF(H47>=$K$6,($D47&\", \"),\"\"))","v":""},{"$f":"IF(H47>=$K$6,\"\",IF(H47>=$K$7,($D47&\", \"),\"\"))","v":""},{"$f":"IF($H47=\"\",\"\",IF($H47<$K$7,$D47&\", \",\"\"))","v":""},null,0]
[null,null,null,null,null,null,null,null,"","","","","","",null,0]
[null,null,null,null,null,null,null,null,"","","","","","",null,0]
[null,null,null,null,null,null,null,null,"","","","","","",null,0]
[null,null,null,null,null,null,null,null,"","","","","","",null,0]
[null,null,null,null,null,null,null,null,"","","","","","",null,0]
[null,null,null,null,null,null,null,null,"","","","","","",null,0]
[null,null,null,null,null,null,null,null,"","","","","","",null,0]
[null,null,null,null,null,null,null,null,"","","","","","",null,0]
[null,null,null,null,null,null,null,null,"","","","","","",null,0]
[null,null,null,null,null,null,null,null,"","","","","","",null,0]
[null,null,null,null,null,null,null,null,"","","","","","",null,0]
[null,null,null,null,null,null,null,null,"","","","","","",null,0]
[null,null,null,null,null,null,null,null,"","","","","","",null,0]
[null,null,null,null,null,null,null,null,"","","","","","",null,0]
[null,null,null,null,null,null,null,null,"","","","","","",null,0]
[null,null,null,null,null,null,null,null,"","","","","","",null,0]
[null,null,null,null,null,null,null,null,"","","","","","",null,0]
[null,null,null,null,null,null,null,null,"","","","","","",null,0]
[null,null,null,null,null,null,null,null,"","","","","","",null,0]
[null,null,null,null,null,null,null,null,"","","","","","",null,0]
[null,null,null,null,null,null,null,null,"","","","","","",null,0]
[null,null,null,null,null,null,null,null,"","","","","","",null,0]
[null,null,null,null,null,null,null,null,"","","","","","",null,0]
[null,null,null,null,null,null,null,null,"","","","","","",null,0]
[null,null,null,null,null,null,null,null,"","","","","","",null,0]
[null,null,null,null,null,null,null,null,"","","","","","",null,0]
[null,null,null,null,null,null,null,null,"","","","","","",null,0]
[null,null,null,null,null,null,null,null,"","","","","","",null,0]
[null,null,null,null,null,null,null,null,"","","","","","",null,0]
[null,null,null,null,null,null,null,null,"","","","","","",null,0]
[null,null,null,null,null,null,null,null,"","","","","","",null,0]
[null,null,null,null,null,null,null,null,"",{"$f":"IF(E79>=$K$6,\"\",IF(E79>=$K$7,($D79&\", \"),\"\"))","v":""},"",{"$f":"IF(H79>=$K$5,\"\",IF(H79>=$K$6,($D79&\", \"),\"\"))","v":""},{"$f":"IF(H79>=$K$6,\"\",IF(H79>=$K$7,($D79&\", \"),\"\"))","v":""},{"$f":"IF($H79=\"\",\"\",IF($H79<$K$7,$D79&\", \",\"\"))","v":""},null,0]
[null,null,null,null,null,null,null,null,{"$f":"IF(E80>=$K$5,\"\",IF(E80>=$K$6,($D80&\", \"),\"\"))","v":""},"",{"$f":"IF($E80=\"\",\"\",IF($E80<$K$7,$D80&\", \",\"\"))","v":""},"","","",null,{"$f":"IF(H80<>\"\",H80-E80,IF(G80<>\"\",G80-E80,IF(F80<>\"\",F80-E80,IE80)))","v":0}]
[null,null,null,null,null,null,null,null,"","","","","","",null,0]
[null,null,null,null,null,null,null,null,"","","","","","",null,0]
[null,null,null,null,null,null,null,null,"","","","","","",null,0]
[null,null,null,null,null,null,null,null,"","","","","","",null,0]
[null,null,null,null,null,null,null,null,"","","","","","",null,0]
[null,null,null,null,null,null,null,null,"","","","","","",null,0]
[null,null,null,null,null,null,null,null,"","","","","","",null,0]
[null,null,null,null,null,null,null,null,"","","","","","",null,0]
[null,null,null,null,null,null,null,null,"","","","","","",null,0]
[null,null,null,null,null,null,null,null,"","","","","","",null,0]
[null,null,null,null,null,null,null,null,"","","","","","",null,0]
[null,null,null,null,null,null,null,null,"","","","","","",null,0]
[null,null,null,null,null,null,null,null,"","","","","","",null,0]
[null,null,null,null,null,null,null,null,"","","","","","",null,0]
[null,null,null,null,null,null,null,null,"","","","","","",null,0]
[null,null,null,null,null,null,null,null,"","","","","","",null,0]
[null,null,null,null,null,null,null,null,"","","","","","",null,0]
[null,null,null,null,null,null,null,null,"","","","","","",null,0]
[null,null,null,null,null,null,null,null,"","","","","","",null,0]
[null,null,null,null,null,null,null,null,"","","","","","",null,0]
[null,null,null,null,null,null,null,null,"","","","","","",null,0]
[null,null,null,null,null,null,null,null,"","","","","","",null,0]
[null,null,null,null,null,null,null,null,"","","","","","",null,0]
[null,null,null,null,null,null,null,null,"","","","","","",null,0]
[null,null,null,null,null,null,null,null,"","","","","","",null,0]
[null,null,null,null,null,null,null,null,"","","","","","",null,0]
[null,null,null,null,null,null,null,null,"","","","","","",null,0]
[null,null,null,null,null,null,null,null,"","","","","","",null,0]
[null,null,null,null,null,null,null,null,"","","","","","",null,0]
[null,null,null,null,null,null,null,null,"","","","","","",null,0]
[null,null,null,null,null,null,null,null,"","","",{"$f":"IF(H111>=$K$5,\"\",IF(H111>=$K$6,($D111&\", \"),\"\"))","v":""},{"$f":"IF(H111>=$K$6,\"\",IF(H111>=$K$7,($D111&\", \"),\"\"))","v":""},{"$f":"IF($H111=\"\",\"\",IF($H111<$K$7,$D111&\", \",\"\"))","v":""},null,0]
[null,null,null,null,null,null,null,null,"","","","","","",null,0]
[null,null,null,null,null,null,null,null,"","","","","","",null,0]
[null,null,null,null,null,null,null,null,"","","","","","",null,0]
[null,null,null,null,null,null,null,null,"","","","","","",null,0]
[null,null,null,null,null,null,null,null,"","","","","","",null,0]
[null,null,null,null,null,null,null,null,"","","","","","",null,0]
[null,null,null,null,null,null,null,null,"","","","","","",null,0]
[null,null,null,null,null,null,null,null,"","","","","","",null,0]
[null,null,null,null,null,null,null,null,"","","","","","",null,0]
[null,null,null,null,null,null,null,null,"","","","","","",null,0]
[null,null,null,null,null,null,null,null,"","","","","","",null,0]
[null,null,null,null,null,null,null,null,"","","","","","",null,0]
[null,null,null,null,null,null,null,null,"","","","","","",null,0]
[null,null,null,null,null,null,null,null,"","","","","","",null,0]
[null,null,null,null,null,null,null,null,"","","","","","",null,0]
[null,null,null,null,null,null,null,null,"","","","","","",null,0]
[null,null,null,null,null,null,null,null,"","","","","","",null,0]
[null,null,null,null,null,null,null,null,"","","","","","",null,0]
[null,null,null,null,null,null,null,null,"","","","","","",null,0]
[null,null,null,null,null,null,null,null,"","","","","","",null,0]
[null,null,null,null,null,null,null,null,"","","","","","",null,0]
[null,null,null,null,null,null,null,null,"","","","","","",null,0]
[null,null,null,null,null,null,null,null,"","","","","","",null,0]
[null,null,null,null,null,null,null,null,"","","","","","",null,0]
[null,null,null,null,null,null,null,null,"","","","","","",null,0]
[null,null,null,null,null,null,null,null,"","","","","","",null,0]
[null,null,null,null,null,null,null,null,"","","","","","",null,0]
[null,null,null,null,null,null,null,null,"","","","","","",null,0]
[null,null,null,null,null,null,null,null,"","","","","","",null,0]
[null,null,null,null,null,null,null,null,"","","","","","",null,0]
[null,null,null,null,null,null,null,null,"","","","","","",null,0]
[null,null,null,null,null,null,null,null,"",{"$f":"IF(E143>=$K$6,\"\",IF(E143>=$K$7,($D143&\", \"),\"\"))","v":""},"",{"$f":"IF(H143>=$K$5,\"\",IF(H143>=$K$6,($D143&\", \"),\"\"))","v":""},{"$f":"IF(H143>=$K$6,\"\",IF(H143>=$K$7,($D143&\", \"),\"\"))","v":""},{"$f":"IF($H143=\"\",\"\",IF($H143<$K$7,$D143&\", \",\"\"))","v":""},null,0]
[null,null,null,null,null,null,null,null,{"$f":"IF(E144>=$K$5,\"\",IF(E144>=$K$6,($D144&\", \"),\"\"))","v":""},"",{"$f":"IF($E144=\"\",\"\",IF($E144<$K$7,$D144&\", \",\"\"))","v":""},"","","",null,{"$f":"IF(H144<>\"\",H144-E144,IF(G144<>\"\",G144-E144,IF(F144<>\"\",F144-E144,IE144)))","v":0}]
[null,null,null,null,null,null,null,null,"","","","","","",null,0]
[null,null,null,null,null,null,null,null,"","","","","","",null,0]
[null,null,null,null,null,null,null,null,"","","","","","",null,0]
[null,null,null,null,null,null,null,null,"","","","","","",null,0]
[null,null,null,null,null,null,null,null,"","","","","","",null,0]
[null,null,null,null,null,null,null,null,"","","","","","",null,0]
[null,null,null,null,null,null,null,null,"","","","","","",null,0]
[null,null,null,null,null,null,null,null,"","","","","","",null,0]
[null,null,null,null,null,null,null,null,"","","","","","",null,0]
[null,null,null,null,null,null,null,null,"","","","","","",null,0]
[null,null,null,null,null,null,null,null,"","","","","","",null,0]
[null,null,null,null,null,null,null,null,"","","","","","",null,0]
[null,null,null,null,null,null,null,null,"","","","","","",null,0]
[null,null,null,null,null,null,null,null,"","","","","","",null,0]
[null,null,null,null,null,null,null,null,"","","","","","",null,0]
[null,null,null,null,null,null,null,null,"","","","","","",null,0]
[null,null,null,null,null,null,null,null,"","","","","","",null,0]
[null,null,null,null,null,null,null,null,"","","","","","",null,0]
[null,null,null,null,null,null,null,null,"","","","","","",null,0]
[null,null,null,null,null,null,null,null,"","","","","","",null,0]
[null,null,null,null,null,null,null,null,null,null,null,null,null,null,null,0]
[null,null,null,null,null,null,null,null,null,null,null,null,null,null,null,0]
[null,null,null,null,null,null,null,null,null,null,null,null,null,null,null,0]
[null,null,null,null,null,null,null,null,null,null,null,null,null,null,null,0]
[null,null,null,null,null,null,null,null,null,null,null,null,null,null,null,0]
[null,null,null,null,null,null,null,null,null,null,null,null,null,null,null,0]
[null,null,null,null,null,null,null,null,null,null,null,null,null,null,null,0]
[null,null,null,null,null,null,null,null,null,null,null,null,null,null,null,0]
[null,null,null,null,null,null,null,null,null,null,null,null,null,null,null,0]
[null,null,null,null,null,null,null,null,null,null,null,null,null,null,null,0]
[null,null,null,null,null,null,null,null,null,null,null,null,null,null,null,0]
[null,null,null,null,null,null,null,null,null,null,null,null,null,null,null,0]
[null,null,null,null,null,null,null,null,null,null,null,null,null,null,null,0]
[null,null,null,null,null,null,null,null,null,null,null,null,null,null,null,0]
[null,null,null,null,null,null,null,null,null,null,null,null,null,null,null,0]
[null,null,null,null,null,null,null,null,null,null,null,null,null,null,null,0]
[null,null,null,null,null,null,null,null,null,null,null,null,null,null,null,0]
[null,null,null,null,null,null,null,null,null,null,null,null,null,null,null,0]
[null,null,null,null,null,null,null,null,null,null,null,null,null,null,null,0]
[null,null,null,null,null,null,null,null,null,null,null,null,null,null,null,0]
[null,null,null,null,null,null,null,null,null,null,null,null,null,null,null,0]
[null,null,null,null,null,null,null,null,null,null,null,null,null,null,null,0]
[null,null,null,null,null,null,null,null,null,null,null,null,null,null,null,0]
[null,null,null,null,null,null,null,null,null,null,null,null,null,null,null,0]
[null,null,null,null,null,null,null,null,null,null,null,null,null,null,null,0]

{"sheet":"Tchr5","index":10,"n_rows":189,"n_cols":18,"rows_kept":189,"cut":false,"hidden":false,"merged":[[8,1,8,3],[9,1,9,3],[10,1,10,3],[11,1,11,3],[2,1,2,3],[3,1,3,3],[4,1,4,3],[5,1,5,3],[6,1,6,3],[7,1,7,3]]}
[null,null,null,null,"Teacher:",{"$f":"IF(Cover!D8=\"\",\"\",Cover!D8)","v":""},null,null,null,"Max:",{"$f":"Cover!J12","v":5}]
[null,null,null,null,{"$f":"IF(Cover!L3=\"\",\"\",Cover!L3)","v":""},{"$f":"IF(Cover!L4=\"\",\"\",Cover!L4)","v":""},{"$f":"IF(Cover!L5=\"\",\"\",Cover!L5)","v":""},{"$f":"IF(Cover!L6=\"\",\"\",Cover!L6)","v":""}]
[null,null,null,null,{"$f":"E14","v":"CFA 1 Pre"},{"$f":"F14","v":"CFA 2 Mid"},{"$f":"G14","v":"CFA 3 Post"},{"$f":"H14","v":"CFA 4"},null,null,null,null,null,null,null,"Change"]
[null,"Total Taking:",null,null,{"$f":"COUNT(E15:E189)","v":0},{"$f":"COUNT(F15:F189)","v":0},{"$f":"COUNT(G15:G189)","v":0},{"$f":"COUNT(H15:H189)","v":0},null,"MinExceed:",null,null,null,null,null,{"$f":"IF(H4>0,H4-E4,IF(G4>0,G4-E4,IF(F4>0,F4-E4,IE4)))","v":0}]
[null,{"$f":"\"Number \"&Cover!$K$13&\"  (>=\" & Cover!$J$13 & \")\"","v":"Number PROFICIENT  (>=4)"},null,null,{"$f":"COUNTIF(E15:E189,\">=\"&K5)","v":0},{"$f":"COUNTIF(F15:F189,\">=\"&K5)","v":0},{"$f":"COUNTIF(G15:G189,\">=\"&K5)","v":0},{"$f":"COUNTIF(H15:H189,\">=\"&K5)","v":0},null,"MinProf:",{"$f":"Cover!J13","v":4},null,null,null,null,0]
[null,{"$f":"\"Percent \"&Cover!$K$13&\"  (>=\" & Cover!$J$13 & \")\"","v":"Percent PROFICIENT  (>=4)"},null,null,{"$f":"IF(E4=0,0,E5/E4)","v":0},{"$f":"IF(F4=0,0,F5/F4)","v":0},{"$f":"IF(G4=0,0,G5/G4)","v":0},0,null,"Close:",{"$f":"Cover!J14","v":3},null,null,null,null,0]
[null,{"$f":"\"Number \"&Cover!$K$14&\" (Between \" & Cover!$J$14 & \" & \" & Cover!$J$13-1 & \")\"","v":"Number CLOSE TO (Between 3 & 3)"},null,null,{"$f":"COUNTIF(E$15:E$189,\">=\"&$K$6)-COUNTIF(E$15:E$189,\">=\"&$K$5)","v":0},{"$f":"COUNTIF(F$15:F$189,\">=\"&$K$6)-COUNTIF(F$15:F$189,\">=\"&$K$5)","v":0},{"$f":"COUNTIF(G$15:G$189,\">=\"&$K$6)-COUNTIF(G$15:G$189,\">=\"&$K$5)","v":0},{"$f":"COUNTIF(H$15:H$189,\">=\"&$K$6)-COUNTIF(H$15:H$189,\">=\"&$K$5)","v":0},null,"Far to Go:",{"$f":"Cover!J15","v":2},null,null,null,null,0]
[null,{"$f":"\"Percent \"&Cover!$K$14&\" (Between \" & Cover!$J$14 & \" & \" & Cover!$J$13-1 & \")\"","v":"Percent CLOSE TO (Between 3 & 3)"},null,null,{"$f":"IF(E4=0,0,E7/E4)","v":0},{"$f":"IF(F4=0,0,F7/F4)","v":0},{"$f":"IF(G4=0,0,G7/G4)","v":0},0,null,null,null,null,null,null,null,0]
[null,{"$f":"\"Number \"&Cover!$K$15&\" (Between \" & Cover!$J$15 & \" & \" & Cover!$J$14-1 & \")\"","v":"Number PROGRESSING (Between 2 & 2)"},null,null,{"$f":"COUNTIF(E$15:E$189,\">=\"&$K$7)-COUNTIF(E$15:E$189,\">=\"&$K$6)","v":0},{"$f":"COUNTIF(F$15:F$189,\">=\"&$K$7)-COUNTIF(F$15:F$189,\">=\"&$K$6)","v":0},{"$f":"COUNTIF(G$15:G$189,\">=\"&$K$7)-COUNTIF(G$15:G$189,\">=\"&$K$6)","v":0},0,null,null,null,null,null,null,null,0]
[null,{"$f":"\"Percent \"&Cover!$K$15&\" (Between \" & Cover!$J$15 & \" & \" & Cover!$J$14-1 & \")\"","v":"Percent PROGRESSING (Between 2 & 2)"},null,null,{"$f":"IF(E4=0,0,E9/E4)","v":0},{"$f":"IF(F4=0,0,F9/F4)","v":0},{"$f":"IF(G4=0,0,G9/G4)","v":0},0,null,null,null,null,null,null,null,0]
[null,{"$f":"\"Number \"&Cover!$K$16&\" (Between \" & Cover!$J$16 & \" & \" & Cover!$J$15-1 & \")\"","v":"Number NEEDS PRACTICE (Between 1 & 1)"},null,null,{"$f":"COUNTIF(E$15:E$189,\"<\"&$K$7)","v":0},{"$f":"COUNTIF(F$15:F$189,\"<\"&$K$7)","v":0},{"$f":"COUNTIF(G$15:G$189,\"<\"&$K$7)","v":0},0,null,null,null,null,null,null,null,0]
[null,{"$f":"\"Percent \"&Cover!$K$16&\" (Between \" & Cover!$J$16 & \" & \" & Cover!$J$15-1 & \")\"","v":"Percent NEEDS PRACTICE (Between 1 & 1)"},null,null,{"$f":"IF(E4=0,0,E11/E4)","v":0},{"$f":"IF(F4=0,0,F11/F4)","v":0},{"$f":"IF(G4=0,0,G11/G4)","v":0},0,{"$f":"CONCATENATE(I15,I16,I17,I18,I19,I20,I21,I22,I23,I24,I25,I26,I27,I28,I29,I30,I31,I32,I33,I34,I35,I36,I37,I38,I39,I40,I41,I42,I43,I44,I45,I46,I47,I48,I49,I50,I51,I52,I53,I54,I55,I56,I57,I58,I59,I60,I61,I62,I63,I64,I65,I66,I67,I68,I69,I70,I71,I72,I73,I74,I75,I76,I77,I78,I79,I80,I81,I82,I83,I84,I85,I86,I87,I88,I89,I90,I91,I92,I93,I94,I95,I96,I97,I98,I99,I100,I101,I102,I103,I104,I105,I106,I107,I108,I109,I110,I111,I112,I113,I114,I115,I116,I117,I118,I119,I120,I121,I122,I123,I124,I125,I126,I127,I128,I129,I130,I131,I132,I133,I134,I135,I136,I137,I138,I139,I140,I141,I142,I143,I144,I145,I146,I147,I148,I149,I150,I151,I152,I153,I154,I155,I156,I157,I158,I159,I160,I161,I162,I163,I164)","v":""},{"$f":"CONCATENATE(J15,J16,J17,J18,J19,J20,J21,J22,J23,J24,J25,J26,J27,J28,J29,J30,J31,J32,J33,J34,J35,J36,J37,J38,J39,J40,J41,J42,J43,J44,J45,J46,J47,J48,J49,J50,J51,J52,J53,J54,J55,J56,J57,J58,J59,J60,J61,J62,J63,J64,J65,J66,J67,J68,J69,J70,J71,J72,J73,J74,J75,J76,J77,J78,J79,J80,J81,J82,J83,J84,J85,J86,J87,J88,J89,J90,J91,J92,J93,J94,J95,J96,J97,J98,J99,J100,J101,J102,J103,J104,J105,J106,J107,J108,J109,J110,J111,J112,J113,J114,J115,J116,J117,J118,J119,J120,J121,J122,J123,J124,J125,J126,J127,J128,J129,J130,J131,J132,J133,J134,J135,J136,J137,J138,J139,J140,J141,J142,J143,J144,J145,J146,J147,J148,J149,J150,J151,J152,J153,J154,J155,J156,J157,J158,J159,J160,J161,J162,J163,J164)","v":""},"","","","",null,0]
[]
[null,"Period","Student Number","Student Name",{"$f":"IF(Cover!J3=\"\",\"\",Cover!J3)","v":"CFA 1 Pre"},{"$f":"IF(Cover!J4=\"\",\"\",Cover!J4)","v":"CFA 2 Mid"},{"$f":"IF(Cover!J5=\"\",\"\",Cover!J5)","v":"CFA 3 Post"},{"$f":"IF(Cover!J6=\"\",\"\",Cover!J6)","v":"CFA 4"},"Pre Close","Pre Far Likely","Pre Extensive","Post Close","Post Far to Go ","Post Extensive",null,"Growth",null,"Return to Cover"]
[null,null,null,null,null,null,null,null,{"$f":"IF(E15>=$K$5,\"\",IF(E15>=$K$6,($D15&\", \"),\"\"))","v":""},{"$f":"IF(E15>=$K$6,\"\",IF(E15>=$K$7,($D15&\", \"),\"\"))","v":""},{"$f":"IF($E15=\"\",\"\",IF($E15<$K$7,$D15&\", \",\"\"))","v":""},{"$f":"IF(H15>=$K$5,\"\",IF(H15>=$K$6,($D15&\", \"),\"\"))","v":""},{"$f":"IF(H15>=$K$6,\"\",IF(H15>=$K$7,($D15&\", \"),\"\"))","v":""},{"$f":"IF($H15=\"\",\"\",IF($H15<$K$7,$D15&\", \",\"\"))","v":""},null,{"$f":"IF(H15<>\"\",H15-E15,IF(G15<>\"\",G15-E15,IF(F15<>\"\",F15-E15,IE15)))","v":0}]
[null,null,null,null,null,null,null,null,{"$f":"IF(E16>=$K$5,\"\",IF(E16>=$K$6,($D16&\", \"),\"\"))","v":""},{"$f":"IF(E16>=$K$6,\"\",IF(E16>=$K$7,($D16&\", \"),\"\"))","v":""},{"$f":"IF($E16=\"\",\"\",IF($E16<$K$7,$D16&\", \",\"\"))","v":""},"","","",null,{"$f":"IF(H16<>\"\",H16-E16,IF(G16<>\"\",G16-E16,IF(F16<>\"\",F16-E16,E16)))","v":0}]
[null,null,null,null,null,null,null,null,{"$f":"IF(E17>=$K$5,\"\",IF(E17>=$K$6,($D17&\", \"),\"\"))","v":""},{"$f":"IF(E17>=$K$6,\"\",IF(E17>=$K$7,($D17&\", \"),\"\"))","v":""},{"$f":"IF($E17=\"\",\"\",IF($E17<$K$7,$D17&\", \",\"\"))","v":""},"","","",null,{"$f":"IF(H17<>\"\",H17-E17,IF(G17<>\"\",G17-E17,IF(F17<>\"\",F17-E17,E17)))","v":0}]
[null,null,null,null,null,null,null,null,"","","","","","",null,0]
[null,null,null,null,null,null,null,null,"","","","","","",null,0]
[null,null,null,null,null,null,null,null,"","","","","","",null,0]
[null,null,null,null,null,null,null,null,"","","","","","",null,0]
[null,null,null,null,null,null,null,null,"","","","","","",null,0]
[null,null,null,null,null,null,null,null,"","","","","","",null,0]
[null,null,null,null,null,null,null,null,"","","","","","",null,0]
[null,null,null,null,null,null,null,null,"","","","","","",null,0]
[null,null,null,null,null,null,null,null,"","","","","","",null,0]
[null,null,null,null,null,null,null,null,"","","","","","",null,0]
[null,null,null,null,null,null,null,null,"","","","","","",null,0]
[null,null,null,null,null,null,null,null,"","","","","","",null,0]
[null,null,null,null,null,null,null,null,"","","","","","",null,0]
[null,null,null,null,null,null,null,null,"","","","","","",null,0]
[null,null,null,null,null,null,null,null,"","","","","","",null,0]
[null,null,null,null,null,null,null,null,"","","","","","",null,0]
[null,null,null,null,null,null,null,null,"","","","","","",null,0]
[null,null,null,null,null,null,null,null,"","","","","","",null,0]
[null,null,null,null,null,null,null,null,"","","","","","",null,0]
[null,null,null,null,null,null,null,null,"","","","","","",null,0]
[null,null,null,null,null,null,null,null,"","","","","","",null,0]
[null,null,null,null,null,null,null,null,"","","","","","",null,0]
[null,null,null,null,null,null,null,null,"","","","","","",null,0]
[null,null,null,null,null,null,null,null,"","","","","","",null,0]
[null,null,null,null,null,null,null,null,"","","","","","",null,0]
[null,null,null,null,null,null,null,null,"","","","","","",null,0]
[null,null,null,null,null,null,null,null,"","","","","","",null,0]
[null,null,null,null,null,null,null,null,"","","","","","",null,0]
[null,null,null,null,null,null,null,null,"","","","","","",null,0]
[null,null,null,null,null,null,null,null,"","","",{"$f":"IF(H47>=$K$5,\"\",IF(H47>=$K$6,($D47&\", \"),\"\"))","v":""},{"$f":"IF(H47>=$K$6,\"\",IF(H47>=$K$7,($D47&\", \"),\"\"))","v":""},{"$f":"IF($H47=\"\",\"\",IF($H47<$K$7,$D47&\", \",\"\"))","v":""},null,0]
[null,null,null,null,null,null,null,null,"","","","","","",null,0]
[null,null,null,null,null,null,null,null,"","","","","","",null,0]
[null,null,null,null,null,null,null,null,"","","","","","",null,0]
[null,null,null,null,null,null,null,null,"","","","","","",null,0]
[null,null,null,null,null,null,null,null,"","","","","","",null,0]
[null,null,null,null,null,null,null,null,"","","","","","",null,0]
[null,null,null,null,null,null,null,null,"","","","","","",null,0]
[null,null,null,null,null,null,null,null,"","","","","","",null,0]
[null,null,null,null,null,null,null,null,"","","","","","",null,0]
[null,null,null,null,null,null,null,null,"","","","","","",null,0]
[null,null,null,null,null,null,null,null,"","","","","","",null,0]
[null,null,null,null,null,null,null,null,"","","","","","",null,0]
[null,null,null,null,null,null,null,null,"","","","","","",null,0]
[null,null,null,null,null,null,null,null,"","","","","","",null,0]
[null,null,null,null,null,null,null,null,"","","","","","",null,0]
[null,null,null,null,null,null,null,null,"","","","","","",null,0]
[null,null,null,null,null,null,null,null,"","","","","","",null,0]
[null,null,null,null,null,null,null,null,"","","","","","",null,0]
[null,null,null,null,null,null,null,null,"","","","","","",null,0]
[null,null,null,null,null,null,null,null,"","","","","","",null,0]
[null,null,null,null,null,null,null,null,"","","","","","",null,0]
[null,null,null,null,null,null,null,null,"","","","","","",null,0]
[null,null,null,null,null,null,null,null,"","","","","","",null,0]
[null,null,null,null,null,null,null,null,"","","","","","",null,0]
[null,null,null,null,null,null,null,null,"","","","","","",null,0]
[null,null,null,null,null,null,null,null,"","","","","","",null,0]
[null,null,null,null,null,null,null,null,"","","","","","",null,0]
[null,null,null,null,null,null,null,null,"","","","","","",null,0]
[null,null,null,null,null,null,null,null,"","","","","","",null,0]
[null,null,null,null,null,null,null,null,"","","","","","",null,0]
[null,null,null,null,null,null,null,null,"","","","","","",null,0]
[null,null,null,null,null,null,null,null,"",{"$f":"IF(E79>=$K$6,\"\",IF(E79>=$K$7,($D79&\", \"),\"\"))","v":""},"",{"$f":"IF(H79>=$K$5,\"\",IF(H79>=$K$6,($D79&\", \"),\"\"))","v":""},{"$f":"IF(H79>=$K$6,\"\",IF(H79>=$K$7,($D79&\", \"),\"\"))","v":""},{"$f":"IF($H79=\"\",\"\",IF($H79<$K$7,$D79&\", \",\"\"))","v":""},null,0]
[null,null,null,null,null,null,null,null,{"$f":"IF(E80>=$K$5,\"\",IF(E80>=$K$6,($D80&\", \"),\"\"))","v":""},"",{"$f":"IF($E80=\"\",\"\",IF($E80<$K$7,$D80&\", \",\"\"))","v":""},"","","",null,{"$f":"IF(H80<>\"\",H80-E80,IF(G80<>\"\",G80-E80,IF(F80<>\"\",F80-E80,E80)))","v":0}]
[null,null,null,null,null,null,null,null,"","","","","","",null,0]
[null,null,null,null,null,null,null,null,"","","","","","",null,0]
[null,null,null,null,null,null,null,null,"","","","","","",null,0]
[null,null,null,null,null,null,null,null,"","","","","","",null,0]
[null,null,null,null,null,null,null,null,"","","","","","",null,0]
[null,null,null,null,null,null,null,null,"","","","","","",null,0]
[null,null,null,null,null,null,null,null,"","","","","","",null,0]
[null,null,null,null,null,null,null,null,"","","","","","",null,0]
[null,null,null,null,null,null,null,null,"","","","","","",null,0]
[null,null,null,null,null,null,null,null,"","","","","","",null,0]
[null,null,null,null,null,null,null,null,"","","","","","",null,0]
[null,null,null,null,null,null,null,null,"","","","","","",null,0]
[null,null,null,null,null,null,null,null,"","","","","","",null,0]
[null,null,null,null,null,null,null,null,"","","","","","",null,0]
[null,null,null,null,null,null,null,null,"","","","","","",null,0]
[null,null,null,null,null,null,null,null,"","","","","","",null,0]
[null,null,null,null,null,null,null,null,"","","","","","",null,0]
[null,null,null,null,null,null,null,null,"","","","","","",null,0]
[null,null,null,null,null,null,null,null,"","","","","","",null,0]
[null,null,null,null,null,null,null,null,"","","","","","",null,0]
[null,null,null,null,null,null,null,null,"","","","","","",null,0]
[null,null,null,null,null,null,null,null,"","","","","","",null,0]
[null,null,null,null,null,null,null,null,"","","","","","",null,0]
[null,null,null,null,null,null,null,null,"","","","","","",null,0]
[null,null,null,null,null,null,null,null,"","","","","","",null,0]
[null,null,null,null,null,null,null,null,"","","","","","",null,0]
[null,null,null,null,null,null,null,null,"","","","","","",null,0]
[null,null,null,null,null,null,null,null,"","","","","","",null,0]
[null,null,null,null,null,null,null,null,"","","","","","",null,0]
[null,null,null,null,null,null,null,null,"","","","","","",null,0]
[null,null,null,null,null,null,null,null,"","","",{"$f":"IF(H111>=$K$5,\"\",IF(H111>=$K$6,($D111&\", \"),\"\"))","v":""},{"$f":"IF(H111>=$K$6,\"\",IF(H111>=$K$7,($D111&\", \"),\"\"))","v":""},{"$f":"IF($H111=\"\",\"\",IF($H111<$K$7,$D111&\", \",\"\"))","v":""},null,0]
[null,null,null,null,null,null,null,null,"","","","","","",null,0]
[null,null,null,null,null,null,null,null,"","","","","","",null,0]
[null,null,null,null,null,null,null,null,"","","","","","",null,0]
[null,null,null,null,null,null,null,null,"","","","","","",null,0]
[null,null,null,null,null,null,null,null,"","","","","","",null,0]
[null,null,null,null,null,null,null,null,"","","","","","",null,0]
[null,null,null,null,null,null,null,null,"","","","","","",null,0]
[null,null,null,null,null,null,null,null,"","","","","","",null,0]
[null,null,null,null,null,null,null,null,"","","","","","",null,0]
[null,null,null,null,null,null,null,null,"","","","","","",null,0]
[null,null,null,null,null,null,null,null,"","","","","","",null,0]
[null,null,null,null,null,null,null,null,"","","","","","",null,0]
[null,null,null,null,null,null,null,null,"","","","","","",null,0]
[null,null,null,null,null,null,null,null,"","","","","","",null,0]
[null,null,null,null,null,null,null,null,"","","","","","",null,0]
[null,null,null,null,null,null,null,null,"","","","","","",null,0]
[null,null,null,null,null,null,null,null,"","","","","","",null,0]
[null,null,null,null,null,null,null,null,"","","","","","",null,0]
[null,null,null,null,null,null,null,null,"","","","","","",null,0]
[null,null,null,null,null,null,null,null,"","","","","","",null,0]
[null,null,null,null,null,null,null,null,"","","","","","",null,0]
[null,null,null,null,null,null,null,null,"","","","","","",null,0]
[null,null,null,null,null,null,null,null,"","","","","","",null,0]
[null,null,null,null,null,null,null,null,"","","","","","",null,0]
[null,null,null,null,null,null,null,null,"","","","","","",null,0]
[null,null,null,null,null,null,null,null,"","","","","","",null,0]
[null,null,null,null,null,null,null,null,"","","","","","",null,0]
[null,null,null,null,null,null,null,null,"","","","","","",null,0]
[null,null,null,null,null,null,null,null,"","","","","","",null,0]
[null,null,null,null,null,null,null,null,"","","","","","",null,0]
[null,null,null,null,null,null,null,null,"","","","","","",null,0]
[null,null,null,null,null,null,null,null,"",{"$f":"IF(E143>=$K$6,\"\",IF(E143>=$K$7,($D143&\", \"),\"\"))","v":""},"",{"$f":"IF(H143>=$K$5,\"\",IF(H143>=$K$6,($D143&\", \"),\"\"))","v":""},{"$f":"IF(H143>=$K$6,\"\",IF(H143>=$K$7,($D143&\", \"),\"\"))","v":""},{"$f":"IF($H143=\"\",\"\",IF($H143<$K$7,$D143&\", \",\"\"))","v":""},null,0]
[null,null,null,null,null,null,null,null,{"$f":"IF(E144>=$K$5,\"\",IF(E144>=$K$6,($D144&\", \"),\"\"))","v":""},"",{"$f":"IF($E144=\"\",\"\",IF($E144<$K$7,$D144&\", \",\"\"))","v":""},"","","",null,{"$f":"IF(H144<>\"\",H144-E144,IF(G144<>\"\",G144-E144,IF(F144<>\"\",F144-E144,E144)))","v":0}]
[null,null,null,null,null,null,null,null,"","","","","","",null,0]
[null,null,null,null,null,null,null,null,"","","","","","",null,0]
[null,null,null,null,null,null,null,null,"","","","","","",null,0]
[null,null,null,null,null,null,null,null,"","","","","","",null,0]
[null,null,null,null,null,null,null,null,"","","","","","",null,0]
[null,null,null,null,null,null,null,null,"","","","","","",null,0]
[null,null,null,null,null,null,null,null,"","","","","","",null,0]
[null,null,null,null,null,null,null,null,"","","","","","",null,0]
[null,null,null,null,null,null,null,null,"","","","","","",null,0]
[null,null,null,null,null,null,null,null,"","","","","","",null,0]
[null,null,null,null,null,null,null,null,"","","","","","",null,0]
[null,null,null,null,null,null,null,null,"","","","","","",null,0]
[null,null,null,null,null,null,null,null,"","","","","","",null,0]
[null,null,null,null,null,null,null,null,"","","","","","",null,0]
[null,null,null,null,null,null,null,null,"","","","","","",null,0]
[null,null,null,null,null,null,null,null,"","","","","","",null,0]
[null,null,null,null,null,null,null,null,"","","","","","",null,0]
[null,null,null,null,null,null,null,null,"","","","","","",null,0]
[null,null,null,null,null,null,null,null,"","","","","","",null,0]
[null,null,null,null,null,null,null,null,"","","","","","",null,0]
[null,null,null,null,null,null,null,null,null,null,null,null,null,null,null,0]
[null,null,null,null,null,null,null,null,null,null,null,null,null,null,null,0]
[null,null,null,null,null,null,null,null,null,null,null,null,null,null,null,0]
[null,null,null,null,null,null,null,null,null,null,null,null,null,null,null,0]
[null,null,null,null,null,null,null,null,null,null,null,null,null,null,null,0]
[null,null,null,null,null,null,null,null,null,null,null,null,null,null,null,0]
[null,null,null,null,null,null,null,null,null,null,null,null,null,null,null,0]
[null,null,null,null,null,null,null,null,null,null,null,null,null,null,null,0]
[null,null,null,null,null,null,null,null,null,null,null,null,null,null,null,0]
[null,null,null,null,null,null,null,null,null,null,null,null,null,null,null,0]
[null,null,null,null,null,null,null,null,null,null,null,null,null,null,null,0]
[null,null,null,null,null,null,null,null,null,null,null,null,null,null,null,0]
[null,null,null,null,null,null,null,null,null,null,null,null,null,null,null,0]
[null,null,null,null,null,null,null,null,null,null,null,null,null,null,null,0]
[null,null,null,null,null,null,null,null,null,null,null,null,null,null,null,0]
[null,null,null,null,null,null,null,null,null,null,null,null,null,null,null,0]
[null,null,null,null,null,null,null,null,null,null,null,null,null,null,null,0]
[null,null,null,null,null,null,null,null,null,null,null,null,null,null,null,0]
[null,null,null,null,null,null,null,null,null,null,null,null,null,null,null,0]
[null,null,null,null,null,null,null,null,null,null,null,null,null,null,null,0]
[null,null,null,null,null,null,null,null,null,null,null,null,null,null,null,0]
[null,null,null,null,null,null,null,null,null,null,null,null,null,null,null,0]
[null,null,null,null,null,null,null,null,null,null,null,null,null,null,null,0]
[null,null,null,null,null,null,null,null,null,null,null,null,null,null,null,0]
[null,null,null,null,null,null,null,null,null,null,null,null,null,null,null,0]

{"sheet":"Tchr6","index":11,"n_rows":189,"n_cols":18,"rows_kept":189,"cut":false,"hidden":false,"merged":[[8,1,8,3],[9,1,9,3],[10,1,10,3],[11,1,11,3],[2,1,2,3],[3,1,3,3],[4,1,4,3],[5,1,5,3],[6,1,6,3],[7,1,7,3]]}
[null,null,null,null,"Teacher:",{"$f":"IF(Cover!D9=\"\",\"\",Cover!D9)","v":""},null,null,null,"Max:",{"$f":"Cover!J12","v":5}]
[null,null,null,null,{"$f":"IF(Cover!L3=\"\",\"\",Cover!L3)","v":""},{"$f":"IF(Cover!L4=\"\",\"\",Cover!L4)","v":""},{"$f":"IF(Cover!L5=\"\",\"\",Cover!L5)","v":""},{"$f":"IF(Cover!L6=\"\",\"\",Cover!L6)","v":""}]
[null,null,null,null,{"$f":"E14","v":"CFA 1 Pre"},{"$f":"F14","v":"CFA 2 Mid"},{"$f":"G14","v":"CFA 3 Post"},{"$f":"H14","v":"CFA 4"},null,null,null,null,null,null,null,"Change"]
[null,"Total Taking:",null,null,{"$f":"COUNT(E15:E189)","v":0},{"$f":"COUNT(F15:F189)","v":0},{"$f":"COUNT(G15:G189)","v":0},{"$f":"COUNT(H15:H189)","v":0},null,"MinExceed:",null,null,null,null,null,{"$f":"IF(H4>0,H4-E4,IF(G4>0,G4-E4,IF(F4>0,F4-E4,IE4)))","v":0}]
[null,{"$f":"\"Number \"&Cover!$K$13&\"  (>=\" & Cover!$J$13 & \")\"","v":"Number PROFICIENT  (>=4)"},null,null,{"$f":"COUNTIF(E15:E189,\">=\"&K5)","v":0},{"$f":"COUNTIF(F15:F189,\">=\"&K5)","v":0},{"$f":"COUNTIF(G15:G189,\">=\"&K5)","v":0},{"$f":"COUNTIF(H15:H189,\">=\"&K5)","v":0},null,"MinProf:",{"$f":"Cover!J13","v":4},null,null,null,null,0]
[null,{"$f":"\"Percent \"&Cover!$K$13&\"  (>=\" & Cover!$J$13 & \")\"","v":"Percent PROFICIENT  (>=4)"},null,null,{"$f":"IF(E4=0,0,E5/E4)","v":0},{"$f":"IF(F4=0,0,F5/F4)","v":0},{"$f":"IF(G4=0,0,G5/G4)","v":0},0,null,"Close:",{"$f":"Cover!J14","v":3},null,null,null,null,0]
[null,{"$f":"\"Number \"&Cover!$K$14&\" (Between \" & Cover!$J$14 & \" & \" & Cover!$J$13-1 & \")\"","v":"Number CLOSE TO (Between 3 & 3)"},null,null,{"$f":"COUNTIF(E$15:E$189,\">=\"&$K$6)-COUNTIF(E$15:E$189,\">=\"&$K$5)","v":0},{"$f":"COUNTIF(F$15:F$189,\">=\"&$K$6)-COUNTIF(F$15:F$189,\">=\"&$K$5)","v":0},{"$f":"COUNTIF(G$15:G$189,\">=\"&$K$6)-COUNTIF(G$15:G$189,\">=\"&$K$5)","v":0},{"$f":"COUNTIF(H$15:H$189,\">=\"&$K$6)-COUNTIF(H$15:H$189,\">=\"&$K$5)","v":0},null,"Far to Go:",{"$f":"Cover!J15","v":2},null,null,null,null,0]
[null,{"$f":"\"Percent \"&Cover!$K$14&\" (Between \" & Cover!$J$14 & \" & \" & Cover!$J$13-1 & \")\"","v":"Percent CLOSE TO (Between 3 & 3)"},null,null,{"$f":"IF(E4=0,0,E7/E4)","v":0},{"$f":"IF(F4=0,0,F7/F4)","v":0},{"$f":"IF(G4=0,0,G7/G4)","v":0},0,null,null,null,null,null,null,null,0]
[null,{"$f":"\"Number \"&Cover!$K$15&\" (Between \" & Cover!$J$15 & \" & \" & Cover!$J$14-1 & \")\"","v":"Number PROGRESSING (Between 2 & 2)"},null,null,{"$f":"COUNTIF(E$15:E$189,\">=\"&$K$7)-COUNTIF(E$15:E$189,\">=\"&$K$6)","v":0},{"$f":"COUNTIF(F$15:F$189,\">=\"&$K$7)-COUNTIF(F$15:F$189,\">=\"&$K$6)","v":0},{"$f":"COUNTIF(G$15:G$189,\">=\"&$K$7)-COUNTIF(G$15:G$189,\">=\"&$K$6)","v":0},0,null,null,null,null,null,null,null,0]
[null,{"$f":"\"Percent \"&Cover!$K$15&\" (Between \" & Cover!$J$15 & \" & \" & Cover!$J$14-1 & \")\"","v":"Percent PROGRESSING (Between 2 & 2)"},null,null,{"$f":"IF(E4=0,0,E9/E4)","v":0},{"$f":"IF(F4=0,0,F9/F4)","v":0},{"$f":"IF(G4=0,0,G9/G4)","v":0},0,null,null,null,null,null,null,null,0]
[null,{"$f":"\"Number \"&Cover!$K$16&\" (Between \" & Cover!$J$16 & \" & \" & Cover!$J$15-1 & \")\"","v":"Number NEEDS PRACTICE (Between 1 & 1)"},null,null,{"$f":"COUNTIF(E$15:E$189,\"<\"&$K$7)","v":0},{"$f":"COUNTIF(F$15:F$189,\"<\"&$K$7)","v":0},{"$f":"COUNTIF(G$15:G$189,\"<\"&$K$7)","v":0},0,null,null,null,null,null,null,null,0]
[null,{"$f":"\"Percent \"&Cover!$K$16&\" (Between \" & Cover!$J$16 & \" & \" & Cover!$J$15-1 & \")\"","v":"Percent NEEDS PRACTICE (Between 1 & 1)"},null,null,{"$f":"IF(E4=0,0,E11/E4)","v":0},{"$f":"IF(F4=0,0,F11/F4)","v":0},{"$f":"IF(G4=0,0,G11/G4)","v":0},0,{"$f":"CONCATENATE(I15,I16,I17,I18,I19,I20,I21,I22,I23,I24,I25,I26,I27,I28,I29,I30,I31,I32,I33,I34,I35,I36,I37,I38,I39,I40,I41,I42,I43,I44,I45,I46,I47,I48,I49,I50,I51,I52,I53,I54,I55,I56,I57,I58,I59,I60,I61,I62,I63,I64,I65,I66,I67,I68,I69,I70,I71,I72,I73,I74,I75,I76,I77,I78,I79,I80,I81,I82,I83,I84,I85,I86,I87,I88,I89,I90,I91,I92,I93,I94,I95,I96,I97,I98,I99,I100,I101,I102,I103,I104,I105,I106,I107,I108,I109,I110,I111,I112,I113,I114,I115,I116,I117,I118,I119,I120,I121,I122,I123,I124,I125,I126,I127,I128,I129,I130,I131,I132,I133,I134,I135,I136,I137,I138,I139,I140,I141,I142,I143,I144,I145,I146,I147,I148,I149,I150,I151,I152,I153,I154,I155,I156,I157,I158,I159,I160,I161,I162,I163,I164)","v":""},{"$f":"CONCATENATE(J15,J16,J17,J18,J19,J20,J21,J22,J23,J24,J25,J26,J27,J28,J29,J30,J31,J32,J33,J34,J35,J36,J37,J38,J39,J40,J41,J42,J43,J44,J45,J46,J47,J48,J49,J50,J51,J52,J53,J54,J55,J56,J57,J58,J59,J60,J61,J62,J63,J64,J65,J66,J67,J68,J69,J70,J71,J72,J73,J74,J75,J76,J77,J78,J79,J80,J81,J82,J83,J84,J85,J86,J87,J88,J89,J90,J91,J92,J93,J94,J95,J96,J97,J98,J99,J100,J101,J102,J103,J104,J105,J106,J107,J108,J109,J110,J111,J112,J113,J114,J115,J116,J117,J118,J119,J120,J121,J122,J123,J124,J125,J126,J127,J128,J129,J130,J131,J132,J133,J134,J135,J136,J137,J138,J139,J140,J141,J142,J143,J144,J145,J146,J147,J148,J149,J150,J151,J152,J153,J154,J155,J156,J157,J158,J159,J160,J161,J162,J163,J164)","v":""},"","","","",null,0]
[]
[null,"Period","Student Number","Student Name",{"$f":"IF(Cover!J3=\"\",\"\",Cover!J3)","v":"CFA 1 Pre"},{"$f":"IF(Cover!J4=\"\",\"\",Cover!J4)","v":"CFA 2 Mid"},{"$f":"IF(Cover!J5=\"\",\"\",Cover!J5)","v":"CFA 3 Post"},{"$f":"IF(Cover!J6=\"\",\"\",Cover!J6)","v":"CFA 4"},"Pre Close","Pre Far Likely","Pre Extensive","Post Close","Post Far to Go ","Post Extensive",null,"Growth",null,"Return to Cover"]
[null,null,null,null,null,null,null,null,{"$f":"IF(E15>=$K$5,\"\",IF(E15>=$K$6,($D15&\", \"),\"\"))","v":""},{"$f":"IF(E15>=$K$6,\"\",IF(E15>=$K$7,($D15&\", \"),\"\"))","v":""},{"$f":"IF($E15=\"\",\"\",IF($E15<$K$7,$D15&\", \",\"\"))","v":""},{"$f":"IF(H15>=$K$5,\"\",IF(H15>=$K$6,($D15&\", \"),\"\"))","v":""},{"$f":"IF(H15>=$K$6,\"\",IF(H15>=$K$7,($D15&\", \"),\"\"))","v":""},{"$f":"IF($H15=\"\",\"\",IF($H15<$K$7,$D15&\", \",\"\"))","v":""},null,{"$f":"IF(H15<>\"\",H15-E15,IF(G15<>\"\",G15-E15,IF(F15<>\"\",F15-E15,IE15)))","v":0}]
[null,null,null,null,null,null,null,null,{"$f":"IF(E16>=$K$5,\"\",IF(E16>=$K$6,($D16&\", \"),\"\"))","v":""},"",{"$f":"IF($E16=\"\",\"\",IF($E16<$K$7,$D16&\", \",\"\"))","v":""},"","","",null,{"$f":"IF(H16<>\"\",H16-E16,IF(G16<>\"\",G16-E16,IF(F16<>\"\",F16-E16,IE16)))","v":0}]
[null,null,null,null,null,null,null,null,"","","","","","",null,0]
[null,null,null,null,null,null,null,null,"","","","","","",null,0]
[null,null,null,null,null,null,null,null,"","","","","","",null,0]
[null,null,null,null,null,null,null,null,"","","","","","",null,0]
[null,null,null,null,null,null,null,null,"","","","","","",null,0]
[null,null,null,null,null,null,null,null,"","","","","","",null,0]
[null,null,null,null,null,null,null,null,"","","","","","",null,0]
[null,null,null,null,null,null,null,null,"","","","","","",null,0]
[null,null,null,null,null,null,null,null,"","","","","","",null,0]
[null,null,null,null,null,null,null,null,"","","","","","",null,0]
[null,null,null,null,null,null,null,null,"","","","","","",null,0]
[null,null,null,null,null,null,null,null,"","","","","","",null,0]
[null,null,null,null,null,null,null,null,"","","","","","",null,0]
[null,null,null,null,null,null,null,null,"","","","","","",null,0]
[null,null,null,null,null,null,null,null,"","","","","","",null,0]
[null,null,null,null,null,null,null,null,"","","","","","",null,0]
[null,null,null,null,null,null,null,null,"","","","","","",null,0]
[null,null,null,null,null,null,null,null,"","","","","","",null,0]
[null,null,null,null,null,null,null,null,"","","","","","",null,0]
[null,null,null,null,null,null,null,null,"","","","","","",null,0]
[null,null,null,null,null,null,null,null,"","","","","","",null,0]
[null,null,null,null,null,null,null,null,"","","","","","",null,0]
[null,null,null,null,null,null,null,null,"","","","","","",null,0]
[null,null,null,null,null,null,null,null,"","","","","","",null,0]
[null,null,null,null,null,null,null,null,"","","","","","",null,0]
[null,null,null,null,null,null,null,null,"","","","","","",null,0]
[null,null,null,null,null,null,null,null,"","","","","","",null,0]
[null,null,null,null,null,null,null,null,"","","","","","",null,0]
[null,null,null,null,null,null,null,null,"","","","","","",null,0]
[null,null,null,null,null,null,null,null,"","","","","","",null,0]
[null,null,null,null,null,null,null,null,"","","",{"$f":"IF(H47>=$K$5,\"\",IF(H47>=$K$6,($D47&\", \"),\"\"))","v":""},{"$f":"IF(H47>=$K$6,\"\",IF(H47>=$K$7,($D47&\", \"),\"\"))","v":""},{"$f":"IF($H47=\"\",\"\",IF($H47<$K$7,$D47&\", \",\"\"))","v":""},null,0]
[null,null,null,null,null,null,null,null,"","","","","","",null,0]
[null,null,null,null,null,null,null,null,"","","","","","",null,0]
[null,null,null,null,null,null,null,null,"","","","","","",null,0]
[null,null,null,null,null,null,null,null,"","","","","","",null,0]
[null,null,null,null,null,null,null,null,"","","","","","",null,0]
[null,null,null,null,null,null,null,null,"","","","","","",null,0]
[null,null,null,null,null,null,null,null,"","","","","","",null,0]
[null,null,null,null,null,null,null,null,"","","","","","",null,0]
[null,null,null,null,null,null,null,null,"","","","","","",null,0]
[null,null,null,null,null,null,null,null,"","","","","","",null,0]
[null,null,null,null,null,null,null,null,"","","","","","",null,0]
[null,null,null,null,null,null,null,null,"","","","","","",null,0]
[null,null,null,null,null,null,null,null,"","","","","","",null,0]
[null,null,null,null,null,null,null,null,"","","","","","",null,0]
[null,null,null,null,null,null,null,null,"","","","","","",null,0]
[null,null,null,null,null,null,null,null,"","","","","","",null,0]
[null,null,null,null,null,null,null,null,"","","","","","",null,0]
[null,null,null,null,null,null,null,null,"","","","","","",null,0]
[null,null,null,null,null,null,null,null,"","","","","","",null,0]
[null,null,null,null,null,null,null,null,"","","","","","",null,0]
[null,null,null,null,null,null,null,null,"","","","","","",null,0]
[null,null,null,null,null,null,null,null,"","","","","","",null,0]
[null,null,null,null,null,null,null,null,"","","","","","",null,0]
[null,null,null,null,null,null,null,null,"","","","","","",null,0]
[null,null,null,null,null,null,null,null,"","","","","","",null,0]
[null,null,null,null,null,null,null,null,"","","","","","",null,0]
[null,null,null,null,null,null,null,null,"","","","","","",null,0]
[null,null,null,null,null,null,null,null,"","","","","","",null,0]
[null,null,null,null,null,null,null,null,"","","","","","",null,0]
[null,null,null,null,null,null,null,null,"","","","","","",null,0]
[null,null,null,null,null,null,null,null,"","","","","","",null,0]
[null,null,null,null,null,null,null,null,"",{"$f":"IF(E79>=$K$6,\"\",IF(E79>=$K$7,($D79&\", \"),\"\"))","v":""},"",{"$f":"IF(H79>=$K$5,\"\",IF(H79>=$K$6,($D79&\", \"),\"\"))","v":""},{"$f":"IF(H79>=$K$6,\"\",IF(H79>=$K$7,($D79&\", \"),\"\"))","v":""},{"$f":"IF($H79=\"\",\"\",IF($H79<$K$7,$D79&\", \",\"\"))","v":""},null,0]
[null,null,null,null,null,null,null,null,{"$f":"IF(E80>=$K$5,\"\",IF(E80>=$K$6,($D80&\", \"),\"\"))","v":""},"",{"$f":"IF($E80=\"\",\"\",IF($E80<$K$7,$D80&\", \",\"\"))","v":""},"","","",null,{"$f":"IF(H80<>\"\",H80-E80,IF(G80<>\"\",G80-E80,IF(F80<>\"\",F80-E80,IE80)))","v":0}]
[null,null,null,null,null,null,null,null,"","","","","","",null,0]
[null,null,null,null,null,null,null,null,"","","","","","",null,0]
[null,null,null,null,null,null,null,null,"","","","","","",null,0]
[null,null,null,null,null,null,null,null,"","","","","","",null,0]
[null,null,null,null,null,null,null,null,"","","","","","",null,0]
[null,null,null,null,null,null,null,null,"","","","","","",null,0]
[null,null,null,null,null,null,null,null,"","","","","","",null,0]
[null,null,null,null,null,null,null,null,"","","","","","",null,0]
[null,null,null,null,null,null,null,null,"","","","","","",null,0]
[null,null,null,null,null,null,null,null,"","","","","","",null,0]
[null,null,null,null,null,null,null,null,"","","","","","",null,0]
[null,null,null,null,null,null,null,null,"","","","","","",null,0]
[null,null,null,null,null,null,null,null,"","","","","","",null,0]
[null,null,null,null,null,null,null,null,"","","","","","",null,0]
[null,null,null,null,null,null,null,null,"","","","","","",null,0]
[null,null,null,null,null,null,null,null,"","","","","","",null,0]
[null,null,null,null,null,null,null,null,"","","","","","",null,0]
[null,null,null,null,null,null,null,null,"","","","","","",null,0]
[null,null,null,null,null,null,null,null,"","","","","","",null,0]
[null,null,null,null,null,null,null,null,"","","","","","",null,0]
[null,null,null,null,null,null,null,null,"","","","","","",null,0]
[null,null,null,null,null,null,null,null,"","","","","","",null,0]
[null,null,null,null,null,null,null,null,"","","","","","",null,0]
[null,null,null,null,null,null,null,null,"","","","","","",null,0]
[null,null,null,null,null,null,null,null,"","","","","","",null,0]
[null,null,null,null,null,null,null,null,"","","","","","",null,0]
[null,null,null,null,null,null,null,null,"","","","","","",null,0]
[null,null,null,null,null,null,null,null,"","","","","","",null,0]
[null,null,null,null,null,null,null,null,"","","","","","",null,0]
[null,null,null,null,null,null,null,null,"","","","","","",null,0]
[null,null,null,null,null,null,null,null,"","","",{"$f":"IF(H111>=$K$5,\"\",IF(H111>=$K$6,($D111&\", \"),\"\"))","v":""},{"$f":"IF(H111>=$K$6,\"\",IF(H111>=$K$7,($D111&\", \"),\"\"))","v":""},{"$f":"IF($H111=\"\",\"\",IF($H111<$K$7,$D111&\", \",\"\"))","v":""},null,0]
[null,null,null,null,null,null,null,null,"","","","","","",null,0]
[null,null,null,null,null,null,null,null,"","","","","","",null,0]
[null,null,null,null,null,null,null,null,"","","","","","",null,0]
[null,null,null,null,null,null,null,null,"","","","","","",null,0]
[null,null,null,null,null,null,null,null,"","","","","","",null,0]
[null,null,null,null,null,null,null,null,"","","","","","",null,0]
[null,null,null,null,null,null,null,null,"","","","","","",null,0]
[null,null,null,null,null,null,null,null,"","","","","","",null,0]
[null,null,null,null,null,null,null,null,"","","","","","",null,0]
[null,null,null,null,null,null,null,null,"","","","","","",null,0]
[null,null,null,null,null,null,null,null,"","","","","","",null,0]
[null,null,null,null,null,null,null,null,"","","","","","",null,0]
[null,null,null,null,null,null,null,null,"","","","","","",null,0]
[null,null,null,null,null,null,null,null,"","","","","","",null,0]
[null,null,null,null,null,null,null,null,"","","","","","",null,0]
[null,null,null,null,null,null,null,null,"","","","","","",null,0]
[null,null,null,null,null,null,null,null,"","","","","","",null,0]
[null,null,null,null,null,null,null,null,"","","","","","",null,0]
[null,null,null,null,null,null,null,null,"","","","","","",null,0]
[null,null,null,null,null,null,null,null,"","","","","","",null,0]
[null,null,null,null,null,null,null,null,"","","","","","",null,0]
[null,null,null,null,null,null,null,null,"","","","","","",null,0]
[null,null,null,null,null,null,null,null,"","","","","","",null,0]
[null,null,null,null,null,null,null,null,"","","","","","",null,0]
[null,null,null,null,null,null,null,null,"","","","","","",null,0]
[null,null,null,null,null,null,null,null,"","","","","","",null,0]
[null,null,null,null,null,null,null,null,"","","","","","",null,0]
[null,null,null,null,null,null,null,null,"","","","","","",null,0]
[null,null,null,null,null,null,null,null,"","","","","","",null,0]
[null,null,null,null,null,null,null,null,"","","","","","",null,0]
[null,null,null,null,null,null,null,null,"","","","","","",null,0]
[null,null,null,null,null,null,null,null,"",{"$f":"IF(E143>=$K$6,\"\",IF(E143>=$K$7,($D143&\", \"),\"\"))","v":""},"",{"$f":"IF(H143>=$K$5,\"\",IF(H143>=$K$6,($D143&\", \"),\"\"))","v":""},{"$f":"IF(H143>=$K$6,\"\",IF(H143>=$K$7,($D143&\", \"),\"\"))","v":""},{"$f":"IF($H143=\"\",\"\",IF($H143<$K$7,$D143&\", \",\"\"))","v":""},null,0]
[null,null,null,null,null,null,null,null,{"$f":"IF(E144>=$K$5,\"\",IF(E144>=$K$6,($D144&\", \"),\"\"))","v":""},"",{"$f":"IF($E144=\"\",\"\",IF($E144<$K$7,$D144&\", \",\"\"))","v":""},"","","",null,{"$f":"IF(H144<>\"\",H144-E144,IF(G144<>\"\",G144-E144,IF(F144<>\"\",F144-E144,IE144)))","v":0}]
[null,null,null,null,null,null,null,null,"","","","","","",null,0]
[null,null,null,null,null,null,null,null,"","","","","","",null,0]
[null,null,null,null,null,null,null,null,"","","","","","",null,0]
[null,null,null,null,null,null,null,null,"","","","","","",null,0]
[null,null,null,null,null,null,null,null,"","","","","","",null,0]
[null,null,null,null,null,null,null,null,"","","","","","",null,0]
[null,null,null,null,null,null,null,null,"","","","","","",null,0]
[null,null,null,null,null,null,null,null,"","","","","","",null,0]
[null,null,null,null,null,null,null,null,"","","","","","",null,0]
[null,null,null,null,null,null,null,null,"","","","","","",null,0]
[null,null,null,null,null,null,null,null,"","","","","","",null,0]
[null,null,null,null,null,null,null,null,"","","","","","",null,0]
[null,null,null,null,null,null,null,null,"","","","","","",null,0]
[null,null,null,null,null,null,null,null,"","","","","","",null,0]
[null,null,null,null,null,null,null,null,"","","","","","",null,0]
[null,null,null,null,null,null,null,null,"","","","","","",null,0]
[null,null,null,null,null,null,null,null,"","","","","","",null,0]
[null,null,null,null,null,null,null,null,"","","","","","",null,0]
[null,null,null,null,null,null,null,null,"","","","","","",null,0]
[null,null,null,null,null,null,null,null,"","","","","","",null,0]
[null,null,null,null,null,null,null,null,null,null,null,null,null,null,null,0]
[null,null,null,null,null,null,null,null,null,null,null,null,null,null,null,0]
[null,null,null,null,null,null,null,null,null,null,null,null,null,null,null,0]
[null,null,null,null,null,null,null,null,null,null,null,null,null,null,null,0]
[null,null,null,null,null,null,null,null,null,null,null,null,null,null,null,0]
[null,null,null,null,null,null,null,null,null,null,null,null,null,null,null,0]
[null,null,null,null,null,null,null,null,null,null,null,null,null,null,null,0]
[null,null,null,null,null,null,null,null,null,null,null,null,null,null,null,0]
[null,null,null,null,null,null,null,null,null,null,null,null,null,null,null,0]
[null,null,null,null,null,null,null,null,null,null,null,null,null,null,null,0]
[null,null,null,null,null,null,null,null,null,null,null,null,null,null,null,0]
[null,null,null,null,null,null,null,null,null,null,null,null,null,null,null,0]
[null,null,null,null,null,null,null,null,null,null,null,null,null,null,null,0]
[null,null,null,null,null,null,null,null,null,null,null,null,null,null,null,0]
[null,null,null,null,null,null,null,null,null,null,null,null,null,null,null,0]
[null,null,null,null,null,null,null,null,null,null,null,null,null,null,null,0]
[null,null,null,null,null,null,null,null,null,null,null,null,null,null,null,0]
[null,null,null,null,null,null,null,null,null,null,null,null,null,null,null,0]
[null,null,null,null,null,null,null,null,null,null,null,null,null,null,null,0]
[null,null,null,null,null,null,null,null,null,null,null,null,null,null,null,0]
[null,null,null,null,null,null,null,null,null,null,null,null,null,null,null,0]
[null,null,null,null,null,null,null,null,null,null,null,null,null,null,null,0]
[null,null,null,null,null,null,null,null,null,null,null,null,null,null,null,0]
[null,null,null,null,null,null,null,null,null,null,null,null,null,null,null,0]
[null,null,null,null,null,null,null,null,null,null,null,null,null,null,null,0]

{"sheet":"Tchr7","index":12,"n_rows":189,"n_cols":18,"rows_kept":189,"cut":false,"hidden":false,"merged":[[2,1,2,3],[3,1,3,3],[4,1,4,3],[5,1,5,3],[6,1,6,3],[7,1,7,3],[8,1,8,3],[9,1,9,3],[10,1,10,3],[11,1,11,3]]}
[null,null,null,null,"Teacher:",{"$f":"IF(Cover!D10=\"\",\"\",Cover!D10)","v":""},null,null,null,"Max:",{"$f":"Cover!J12","v":5}]
[null,null,null,null,{"$f":"IF(Cover!L3=\"\",\"\",Cover!L3)","v":""},{"$f":"IF(Cover!L4=\"\",\"\",Cover!L4)","v":""},{"$f":"IF(Cover!L5=\"\",\"\",Cover!L5)","v":""},{"$f":"IF(Cover!L6=\"\",\"\",Cover!L6)","v":""}]
[null,null,null,null,{"$f":"E14","v":"CFA 1 Pre"},{"$f":"F14","v":"CFA 2 Mid"},{"$f":"G14","v":"CFA 3 Post"},{"$f":"H14","v":"CFA 4"},null,null,null,null,null,null,null,"Change"]
[null,"Total Taking:",null,null,{"$f":"COUNT(E15:E189)","v":0},{"$f":"COUNT(F15:F189)","v":0},{"$f":"COUNT(G15:G189)","v":0},{"$f":"COUNT(H15:H189)","v":0},null,"MinExceed:",null,null,null,null,null,{"$f":"IF(H4>0,H4-E4,IF(G4>0,G4-E4,IF(F4>0,F4-E4,IE4)))","v":0}]
[null,{"$f":"\"Number \"&Cover!$K$13&\"  (>=\" & Cover!$J$13 & \")\"","v":"Number PROFICIENT  (>=4)"},null,null,{"$f":"COUNTIF(E15:E189,\">=\"&K5)","v":0},{"$f":"COUNTIF(F15:F189,\">=\"&K5)","v":0},{"$f":"COUNTIF(G15:G189,\">=\"&K5)","v":0},{"$f":"COUNTIF(H15:H189,\">=\"&K5)","v":0},null,"MinProf:",{"$f":"Cover!J13","v":4},null,null,null,null,0]
[null,{"$f":"\"Percent \"&Cover!$K$13&\"  (>=\" & Cover!$J$13 & \")\"","v":"Percent PROFICIENT  (>=4)"},null,null,{"$f":"IF(E4=0,0,E5/E4)","v":0},{"$f":"IF(F4=0,0,F5/F4)","v":0},{"$f":"IF(G4=0,0,G5/G4)","v":0},{"$f":"IF(H4=0,0,H5/H4)","v":0},null,"Close:",{"$f":"Cover!J14","v":3},null,null,null,null,0]
[null,{"$f":"\"Number \"&Cover!$K$14&\" (Between \" & Cover!$J$14 & \" & \" & Cover!$J$13-1 & \")\"","v":"Number CLOSE TO (Between 3 & 3)"},null,null,{"$f":"COUNTIF(E$15:E$189,\">=\"&$K$6)-COUNTIF(E$15:E$189,\">=\"&$K$5)","v":0},{"$f":"COUNTIF(F$15:F$189,\">=\"&$K$6)-COUNTIF(F$15:F$189,\">=\"&$K$5)","v":0},{"$f":"COUNTIF(G$15:G$189,\">=\"&$K$6)-COUNTIF(G$15:G$189,\">=\"&$K$5)","v":0},{"$f":"COUNTIF(H$15:H$189,\">=\"&$K$6)-COUNTIF(H$15:H$189,\">=\"&$K$5)","v":0},null,"Far to Go:",{"$f":"Cover!J15","v":2},null,null,null,null,0]
[null,{"$f":"\"Percent \"&Cover!$K$14&\" (Between \" & Cover!$J$14 & \" & \" & Cover!$J$13-1 & \")\"","v":"Percent CLOSE TO (Between 3 & 3)"},null,null,{"$f":"IF(E4=0,0,E7/E4)","v":0},{"$f":"IF(F4=0,0,F7/F4)","v":0},{"$f":"IF(G4=0,0,G7/G4)","v":0},{"$f":"IF(H4=0,0,H7/H4)","v":0},null,null,null,null,null,null,null,0]
[null,{"$f":"\"Number \"&Cover!$K$15&\" (Between \" & Cover!$J$15 & \" & \" & Cover!$J$14-1 & \")\"","v":"Number PROGRESSING (Between 2 & 2)"},null,null,{"$f":"COUNTIF(E$15:E$189,\">=\"&$K$7)-COUNTIF(E$15:E$189,\">=\"&$K$6)","v":0},{"$f":"COUNTIF(F$15:F$189,\">=\"&$K$7)-COUNTIF(F$15:F$189,\">=\"&$K$6)","v":0},{"$f":"COUNTIF(G$15:G$189,\">=\"&$K$7)-COUNTIF(G$15:G$189,\">=\"&$K$6)","v":0},{"$f":"COUNTIF(H$15:H$189,\">=\"&$K$7)-COUNTIF(H$15:H$189,\">=\"&$K$6)","v":0},null,null,null,null,null,null,null,0]
[null,{"$f":"\"Percent \"&Cover!$K$15&\" (Between \" & Cover!$J$15 & \" & \" & Cover!$J$14-1 & \")\"","v":"Percent PROGRESSING (Between 2 & 2)"},null,null,{"$f":"IF(E4=0,0,E9/E4)","v":0},{"$f":"IF(F4=0,0,F9/F4)","v":0},{"$f":"IF(G4=0,0,G9/G4)","v":0},{"$f":"IF(H4=0,0,H9/H4)","v":0},null,null,null,null,null,null,null,0]
[null,{"$f":"\"Number \"&Cover!$K$16&\" (Between \" & Cover!$J$16 & \" & \" & Cover!$J$15-1 & \")\"","v":"Number NEEDS PRACTICE (Between 1 & 1)"},null,null,{"$f":"COUNTIF(E$15:E$189,\"<\"&$K$7)","v":0},{"$f":"COUNTIF(F$15:F$189,\"<\"&$K$7)","v":0},{"$f":"COUNTIF(G$15:G$189,\"<\"&$K$7)","v":0},{"$f":"COUNTIF(H$15:H$189,\"<\"&$K$7)","v":0},null,null,null,null,null,null,null,0]
[null,{"$f":"\"Percent \"&Cover!$K$16&\" (Between \" & Cover!$J$16 & \" & \" & Cover!$J$15-1 & \")\"","v":"Percent NEEDS PRACTICE (Between 1 & 1)"},null,null,{"$f":"IF(E4=0,0,E11/E4)","v":0},{"$f":"IF(F4=0,0,F11/F4)","v":0},{"$f":"IF(G4=0,0,G11/G4)","v":0},{"$f":"IF(H4=0,0,H11/H4)","v":0},{"$f":"CONCATENATE(I15,I16,I17,I18,I19,I20,I21,I22,I23,I24,I25,I26,I27,I28,I29,I30,I31,I32,I33,I34,I35,I36,I37,I38,I39,I40,I41,I42,I43,I44,I45,I46,I47,I48,I49,I50,I51,I52,I53,I54,I55,I56,I57,I58,I59,I60,I61,I62,I63,I64,I65,I66,I67,I68,I69,I70,I71,I72,I73,I74,I75,I76,I77,I78,I79,I80,I81,I82,I83,I84,I85,I86,I87,I88,I89,I90,I91,I92,I93,I94,I95,I96,I97,I98,I99,I100,I101,I102,I103,I104,I105,I106,I107,I108,I109,I110,I111,I112,I113,I114,I115,I116,I117,I118,I119,I120,I121,I122,I123,I124,I125,I126,I127,I128,I129,I130,I131,I132,I133,I134,I135,I136,I137,I138,I139,I140,I141,I142,I143,I144,I145,I146,I147,I148,I149,I150,I151,I152,I153,I154,I155,I156,I157,I158,I159,I160,I161,I162,I163,I164)","v":""},{"$f":"CONCATENATE(J15,J16,J17,J18,J19,J20,J21,J22,J23,J24,J25,J26,J27,J28,J29,J30,J31,J32,J33,J34,J35,J36,J37,J38,J39,J40,J41,J42,J43,J44,J45,J46,J47,J48,J49,J50,J51,J52,J53,J54,J55,J56,J57,J58,J59,J60,J61,J62,J63,J64,J65,J66,J67,J68,J69,J70,J71,J72,J73,J74,J75,J76,J77,J78,J79,J80,J81,J82,J83,J84,J85,J86,J87,J88,J89,J90,J91,J92,J93,J94,J95,J96,J97,J98,J99,J100,J101,J102,J103,J104,J105,J106,J107,J108,J109,J110,J111,J112,J113,J114,J115,J116,J117,J118,J119,J120,J121,J122,J123,J124,J125,J126,J127,J128,J129,J130,J131,J132,J133,J134,J135,J136,J137,J138,J139,J140,J141,J142,J143,J144,J145,J146,J147,J148,J149,J150,J151,J152,J153,J154,J155,J156,J157,J158,J159,J160,J161,J162,J163,J164)","v":""},"","","","",null,0]
[]
[null,"Period","Student Number","Student Name",{"$f":"IF(Cover!J3=\"\",\"\",Cover!J3)","v":"CFA 1 Pre"},{"$f":"IF(Cover!J4=\"\",\"\",Cover!J4)","v":"CFA 2 Mid"},{"$f":"IF(Cover!J5=\"\",\"\",Cover!J5)","v":"CFA 3 Post"},{"$f":"IF(Cover!J6=\"\",\"\",Cover!J6)","v":"CFA 4"},"Pre Close","Pre Far Likely","Pre Extensive","Post Close","Post Far to Go ","Post Extensive",null,"Growth",null,"Return to Cover"]
[null,null,null,null,null,null,null,null,{"$f":"IF(E15>=$K$5,\"\",IF(E15>=$K$6,($D15&\", \"),\"\"))","v":""},{"$f":"IF(E15>=$K$6,\"\",IF(E15>=$K$7,($D15&\", \"),\"\"))","v":""},{"$f":"IF($E15=\"\",\"\",IF($E15<$K$7,$D15&\", \",\"\"))","v":""},{"$f":"IF(H15>=$K$5,\"\",IF(H15>=$K$6,($D15&\", \"),\"\"))","v":""},{"$f":"IF(H15>=$K$6,\"\",IF(H15>=$K$7,($D15&\", \"),\"\"))","v":""},{"$f":"IF($H15=\"\",\"\",IF($H15<$K$7,$D15&\", \",\"\"))","v":""},null,{"$f":"IF(H15<>\"\",H15-E15,IF(G15<>\"\",G15-E15,IF(F15<>\"\",F15-E15,IE15)))","v":0}]
[null,null,null,null,null,null,null,null,{"$f":"IF(E16>=$K$5,\"\",IF(E16>=$K$6,($D16&\", \"),\"\"))","v":""},"",{"$f":"IF($E16=\"\",\"\",IF($E16<$K$7,$D16&\", \",\"\"))","v":""},"","","",null,{"$f":"IF(H16<>\"\",H16-E16,IF(G16<>\"\",G16-E16,IF(F16<>\"\",F16-E16,IE16)))","v":0}]
[null,null,null,null,null,null,null,null,"","","","","","",null,0]
[null,null,null,null,null,null,null,null,"","","","","","",null,0]
[null,null,null,null,null,null,null,null,"","","","","","",null,0]
[null,null,null,null,null,null,null,null,"","","","","","",null,0]
[null,null,null,null,null,null,null,null,"","","","","","",null,0]
[null,null,null,null,null,null,null,null,"","","","","","",null,0]
[null,null,null,null,null,null,null,null,"","","","","","",null,0]
[null,null,null,null,null,null,null,null,"","","","","","",null,0]
[null,null,null,null,null,null,null,null,"","","","","","",null,0]
[null,null,null,null,null,null,null,null,"","","","","","",null,0]
[null,null,null,null,null,null,null,null,"","","","","","",null,0]
[null,null,null,null,null,null,null,null,"","","","","","",null,0]
[null,null,null,null,null,null,null,null,"","","","","","",null,0]
[null,null,null,null,null,null,null,null,"","","","","","",null,0]
[null,null,null,null,null,null,null,null,"","","","","","",null,0]
[null,null,null,null,null,null,null,null,"","","","","","",null,0]
[null,null,null,null,null,null,null,null,"","","","","","",null,0]
[null,null,null,null,null,null,null,null,"","","","","","",null,0]
[null,null,null,null,null,null,null,null,"","","","","","",null,0]
[null,null,null,null,null,null,null,null,"","","","","","",null,0]
[null,null,null,null,null,null,null,null,"","","","","","",null,0]
[null,null,null,null,null,null,null,null,"","","","","","",null,0]
[null,null,null,null,null,null,null,null,"","","","","","",null,0]
[null,null,null,null,null,null,null,null,"","","","","","",null,0]
[null,null,null,null,null,null,null,null,"","","","","","",null,0]
[null,null,null,null,null,null,null,null,"","","","","","",null,0]
[null,null,null,null,null,null,null,null,"","","","","","",null,0]
[null,null,null,null,null,null,null,null,"","","","","","",null,0]
[null,null,null,null,null,null,null,null,"","","","","","",null,0]
[null,null,null,null,null,null,null,null,"","","","","","",null,0]
[null,null,null,null,null,null,null,null,"","","",{"$f":"IF(H47>=$K$5,\"\",IF(H47>=$K$6,($D47&\", \"),\"\"))","v":""},{"$f":"IF(H47>=$K$6,\"\",IF(H47>=$K$7,($D47&\", \"),\"\"))","v":""},{"$f":"IF($H47=\"\",\"\",IF($H47<$K$7,$D47&\", \",\"\"))","v":""},null,0]
[null,null,null,null,null,null,null,null,"","","","","","",null,0]
[null,null,null,null,null,null,null,null,"","","","","","",null,0]
[null,null,null,null,null,null,null,null,"","","","","","",null,0]
[null,null,null,null,null,null,null,null,"","","","","","",null,0]
[null,null,null,null,null,null,null,null,"","","","","","",null,0]
[null,null,null,null,null,null,null,null,"","","","","","",null,0]
[null,null,null,null,null,null,null,null,"","","","","","",null,0]
[null,null,null,null,null,null,null,null,"","","","","","",null,0]
[null,null,null,null,null,null,null,null,"","","","","","",null,0]
[null,null,null,null,null,null,null,null,"","","","","","",null,0]
[null,null,null,null,null,null,null,null,"","","","","","",null,0]
[null,null,null,null,null,null,null,null,"","","","","","",null,0]
[null,null,null,null,null,null,null,null,"","","","","","",null,0]
[null,null,null,null,null,null,null,null,"","","","","","",null,0]
[null,null,null,null,null,null,null,null,"","","","","","",null,0]
[null,null,null,null,null,null,null,null,"","","","","","",null,0]
[null,null,null,null,null,null,null,null,"","","","","","",null,0]
[null,null,null,null,null,null,null,null,"","","","","","",null,0]
[null,null,null,null,null,null,null,null,"","","","","","",null,0]
[null,null,null,null,null,null,null,null,"","","","","","",null,0]
[null,null,null,null,null,null,null,null,"","","","","","",null,0]
[null,null,null,null,null,null,null,null,"","","","","","",null,0]
[null,null,null,null,null,null,null,null,"","","","","","",null,0]
[null,null,null,null,null,null,null,null,"","","","","","",null,0]
[null,null,null,null,null,null,null,null,"","","","","","",null,0]
[null,null,null,null,null,null,null,null,"","","","","","",null,0]
[null,null,null,null,null,null,null,null,"","","","","","",null,0]
[null,null,null,null,null,null,null,null,"","","","","","",null,0]
[null,null,null,null,null,null,null,null,"","","","","","",null,0]
[null,null,null,null,null,null,null,null,"","","","","","",null,0]
[null,null,null,null,null,null,null,null,"","","","","","",null,0]
[null,null,null,null,null,null,null,null,"",{"$f":"IF(E79>=$K$6,\"\",IF(E79>=$K$7,($D79&\", \"),\"\"))","v":""},"",{"$f":"IF(H79>=$K$5,\"\",IF(H79>=$K$6,($D79&\", \"),\"\"))","v":""},{"$f":"IF(H79>=$K$6,\"\",IF(H79>=$K$7,($D79&\", \"),\"\"))","v":""},{"$f":"IF($H79=\"\",\"\",IF($H79<$K$7,$D79&\", \",\"\"))","v":""},null,0]
[null,null,null,null,null,null,null,null,{"$f":"IF(E80>=$K$5,\"\",IF(E80>=$K$6,($D80&\", \"),\"\"))","v":""},"",{"$f":"IF($E80=\"\",\"\",IF($E80<$K$7,$D80&\", \",\"\"))","v":""},"","","",null,{"$f":"IF(H80<>\"\",H80-E80,IF(G80<>\"\",G80-E80,IF(F80<>\"\",F80-E80,IE80)))","v":0}]
[null,null,null,null,null,null,null,null,"","","","","","",null,0]
[null,null,null,null,null,null,null,null,"","","","","","",null,0]
[null,null,null,null,null,null,null,null,"","","","","","",null,0]
[null,null,null,null,null,null,null,null,"","","","","","",null,0]
[null,null,null,null,null,null,null,null,"","","","","","",null,0]
[null,null,null,null,null,null,null,null,"","","","","","",null,0]
[null,null,null,null,null,null,null,null,"","","","","","",null,0]
[null,null,null,null,null,null,null,null,"","","","","","",null,0]
[null,null,null,null,null,null,null,null,"","","","","","",null,0]
[null,null,null,null,null,null,null,null,"","","","","","",null,0]
[null,null,null,null,null,null,null,null,"","","","","","",null,0]
[null,null,null,null,null,null,null,null,"","","","","","",null,0]
[null,null,null,null,null,null,null,null,"","","","","","",null,0]
[null,null,null,null,null,null,null,null,"","","","","","",null,0]
[null,null,null,null,null,null,null,null,"","","","","","",null,0]
[null,null,null,null,null,null,null,null,"","","","","","",null,0]
[null,null,null,null,null,null,null,null,"","","","","","",null,0]
[null,null,null,null,null,null,null,null,"","","","","","",null,0]
[null,null,null,null,null,null,null,null,"","","","","","",null,0]
[null,null,null,null,null,null,null,null,"","","","","","",null,0]
[null,null,null,null,null,null,null,null,"","","","","","",null,0]
[null,null,null,null,null,null,null,null,"","","","","","",null,0]
[null,null,null,null,null,null,null,null,"","","","","","",null,0]
[null,null,null,null,null,null,null,null,"","","","","","",null,0]
[null,null,null,null,null,null,null,null,"","","","","","",null,0]
[null,null,null,null,null,null,null,null,"","","","","","",null,0]
[null,null,null,null,null,null,null,null,"","","","","","",null,0]
[null,null,null,null,null,null,null,null,"","","","","","",null,0]
[null,null,null,null,null,null,null,null,"","","","","","",null,0]
[null,null,null,null,null,null,null,null,"","","","","","",null,0]
[null,null,null,null,null,null,null,null,"","","",{"$f":"IF(H111>=$K$5,\"\",IF(H111>=$K$6,($D111&\", \"),\"\"))","v":""},{"$f":"IF(H111>=$K$6,\"\",IF(H111>=$K$7,($D111&\", \"),\"\"))","v":""},{"$f":"IF($H111=\"\",\"\",IF($H111<$K$7,$D111&\", \",\"\"))","v":""},null,0]
[null,null,null,null,null,null,null,null,"","","","","","",null,0]
[null,null,null,null,null,null,null,null,"","","","","","",null,0]
[null,null,null,null,null,null,null,null,"","","","","","",null,0]
[null,null,null,null,null,null,null,null,"","","","","","",null,0]
[null,null,null,null,null,null,null,null,"","","","","","",null,0]
[null,null,null,null,null,null,null,null,"","","","","","",null,0]
[null,null,null,null,null,null,null,null,"","","","","","",null,0]
[null,null,null,null,null,null,null,null,"","","","","","",null,0]
[null,null,null,null,null,null,null,null,"","","","","","",null,0]
[null,null,null,null,null,null,null,null,"","","","","","",null,0]
[null,null,null,null,null,null,null,null,"","","","","","",null,0]
[null,null,null,null,null,null,null,null,"","","","","","",null,0]
[null,null,null,null,null,null,null,null,"","","","","","",null,0]
[null,null,null,null,null,null,null,null,"","","","","","",null,0]
[null,null,null,null,null,null,null,null,"","","","","","",null,0]
[null,null,null,null,null,null,null,null,"","","","","","",null,0]
[null,null,null,null,null,null,null,null,"","","","","","",null,0]
[null,null,null,null,null,null,null,null,"","","","","","",null,0]
[null,null,null,null,null,null,null,null,"","","","","","",null,0]
[null,null,null,null,null,null,null,null,"","","","","","",null,0]
[null,null,null,null,null,null,null,null,"","","","","","",null,0]
[null,null,null,null,null,null,null,null,"","","","","","",null,0]
[null,null,null,null,null,null,null,null,"","","","","","",null,0]
[null,null,null,null,null,null,null,null,"","","","","","",null,0]
[null,null,null,null,null,null,null,null,"","","","","","",null,0]
[null,null,null,null,null,null,null,null,"","","","","","",null,0]
[null,null,null,null,null,null,null,null,"","","","","","",null,0]
[null,null,null,null,null,null,null,null,"","","","","","",null,0]
[null,null,null,null,null,null,null,null,"","","","","","",null,0]
[null,null,null,null,null,null,null,null,"","","","","","",null,0]
[null,null,null,null,null,null,null,null,"","","","","","",null,0]
[null,null,null,null,null,null,null,null,"",{"$f":"IF(E143>=$K$6,\"\",IF(E143>=$K$7,($D143&\", \"),\"\"))","v":""},"",{"$f":"IF(H143>=$K$5,\"\",IF(H143>=$K$6,($D143&\", \"),\"\"))","v":""},{"$f":"IF(H143>=$K$6,\"\",IF(H143>=$K$7,($D143&\", \"),\"\"))","v":""},{"$f":"IF($H143=\"\",\"\",IF($H143<$K$7,$D143&\", \",\"\"))","v":""},null,0]
[null,null,null,null,null,null,null,null,{"$f":"IF(E144>=$K$5,\"\",IF(E144>=$K$6,($D144&\", \"),\"\"))","v":""},"",{"$f":"IF($E144=\"\",\"\",IF($E144<$K$7,$D144&\", \",\"\"))","v":""},"","","",null,{"$f":"IF(H144<>\"\",H144-E144,IF(G144<>\"\",G144-E144,IF(F144<>\"\",F144-E144,IE144)))","v":0}]
[null,null,null,null,null,null,null,null,"","","","","","",null,0]
[null,null,null,null,null,null,null,null,"","","","","","",null,0]
[null,null,null,null,null,null,null,null,"","","","","","",null,0]
[null,null,null,null,null,null,null,null,"","","","","","",null,0]
[null,null,null,null,null,null,null,null,"","","","","","",null,0]
[null,null,null,null,null,null,null,null,"","","","","","",null,0]
[null,null,null,null,null,null,null,null,"","","","","","",null,0]
[null,null,null,null,null,null,null,null,"","","","","","",null,0]
[null,null,null,null,null,null,null,null,"","","","","","",null,0]
[null,null,null,null,null,null,null,null,"","","","","","",null,0]
[null,null,null,null,null,null,null,null,"","","","","","",null,0]
[null,null,null,null,null,null,null,null,"","","","","","",null,0]
[null,null,null,null,null,null,null,null,"","","","","","",null,0]
[null,null,null,null,null,null,null,null,"","","","","","",null,0]
[null,null,null,null,null,null,null,null,"","","","","","",null,0]
[null,null,null,null,null,null,null,null,"","","","","","",null,0]
[null,null,null,null,null,null,null,null,"","","","","","",null,0]
[null,null,null,null,null,null,null,null,"","","","","","",null,0]
[null,null,null,null,null,null,null,null,"","","","","","",null,0]
[null,null,null,null,null,null,null,null,"","","","","","",null,0]
[null,null,null,null,null,null,null,null,null,null,null,null,null,null,null,0]
[null,null,null,null,null,null,null,null,null,null,null,null,null,null,null,0]
[null,null,null,null,null,null,null,null,null,null,null,null,null,null,null,0]
[null,null,null,null,null,null,null,null,null,null,null,null,null,null,null,0]
[null,null,null,null,null,null,null,null,null,null,null,null,null,null,null,0]
[null,null,null,null,null,null,null,null,null,null,null,null,null,null,null,0]
[null,null,null,null,null,null,null,null,null,null,null,null,null,null,null,0]
[null,null,null,null,null,null,null,null,null,null,null,null,null,null,null,0]
[null,null,null,null,null,null,null,null,null,null,null,null,null,null,null,0]
[null,null,null,null,null,null,null,null,null,null,null,null,null,null,null,0]
[null,null,null,null,null,null,null,null,null,null,null,null,null,null,null,0]
[null,null,null,null,null,null,null,null,null,null,null,null,null,null,null,0]
[null,null,null,null,null,null,null,null,null,null,null,null,null,null,null,0]
[null,null,null,null,null,null,null,null,null,null,null,null,null,null,null,0]
[null,null,null,null,null,null,null,null,null,null,null,null,null,null,null,0]
[null,null,null,null,null,null,null,null,null,null,null,null,null,null,null,0]
[null,null,null,null,null,null,null,null,null,null,null,null,null,null,null,0]
[null,null,null,null,null,null,null,null,null,null,null,null,null,null,null,0]
[null,null,null,null,null,null,null,null,null,null,null,null,null,null,null,0]
[null,null,null,null,null,null,null,null,null,null,null,null,null,null,null,0]
[null,null,null,null,null,null,null,null,null,null,null,null,null,null,null,0]
[null,null,null,null,null,null,null,null,null,null,null,null,null,null,null,0]
[null,null,null,null,null,null,null,null,null,null,null,null,null,null,null,0]
[null,null,null,null,null,null,null,null,null,null,null,null,null,null,null,0]
[null,null,null,null,null,null,null,null,null,null,null,null,null,null,null,0]

{"sheet":"Tchr8","index":13,"n_rows":189,"n_cols":18,"rows_kept":189,"cut":false,"hidden":false,"merged":[[4,1,4,3],[5,1,5,3],[2,1,2,3],[3,1,3,3],[6,1,6,3],[7,1,7,3],[8,1,8,3],[9,1,9,3],[10,1,10,3],[11,1,11,3]]}
[null,null,null,null,"Teacher:",{"$f":"IF(Cover!D11=\"\",\"\",Cover!D11)","v":""},null,null,null,"Max:",{"$f":"Cover!J12","v":5}]
[null,null,null,null,{"$f":"IF(Cover!L3=\"\",\"\",Cover!L3)","v":""},{"$f":"IF(Cover!L4=\"\",\"\",Cover!L4)","v":""},{"$f":"IF(Cover!L5=\"\",\"\",Cover!L5)","v":""},{"$f":"IF(Cover!L6=\"\",\"\",Cover!L6)","v":""}]
[null,null,null,null,{"$f":"E14","v":"CFA 1 Pre"},{"$f":"F14","v":"CFA 2 Mid"},{"$f":"G14","v":"CFA 3 Post"},{"$f":"H14","v":"CFA 4"},null,null,null,null,null,null,null,"Change"]
[null,"Total Taking:",null,null,{"$f":"COUNT(E15:E189)","v":0},{"$f":"COUNT(F15:F189)","v":0},{"$f":"COUNT(G15:G189)","v":0},{"$f":"COUNT(H15:H189)","v":0},null,"MinExceed:",null,null,null,null,null,{"$f":"IF(H4>0,H4-E4,IF(G4>0,G4-E4,IF(F4>0,F4-E4,IE4)))","v":0}]
[null,{"$f":"\"Number \"&Cover!$K$13&\"  (>=\" & Cover!$J$13 & \")\"","v":"Number PROFICIENT  (>=4)"},null,null,{"$f":"COUNTIF(E15:E189,\">=\"&K5)","v":0},{"$f":"COUNTIF(F15:F189,\">=\"&K5)","v":0},{"$f":"COUNTIF(G15:G189,\">=\"&K5)","v":0},{"$f":"COUNTIF(H15:H189,\">=\"&K5)","v":0},null,"MinProf:",{"$f":"Cover!J13","v":4},null,null,null,null,0]
[null,{"$f":"\"Percent \"&Cover!$K$13&\"  (>=\" & Cover!$J$13 & \")\"","v":"Percent PROFICIENT  (>=4)"},null,null,{"$f":"IF(E4=0,0,E5/E4)","v":0},{"$f":"IF(F4=0,0,F5/F4)","v":0},{"$f":"IF(G4=0,0,G5/G4)","v":0},{"$f":"IF(H4=0,0,H5/H4)","v":0},null,"Close:",{"$f":"Cover!J14","v":3},null,null,null,null,0]
[null,{"$f":"\"Number \"&Cover!$K$14&\" (Between \" & Cover!$J$14 & \" & \" & Cover!$J$13-1 & \")\"","v":"Number CLOSE TO (Between 3 & 3)"},null,null,{"$f":"COUNTIF(E$15:E$189,\">=\"&$K$6)-COUNTIF(E$15:E$189,\">=\"&$K$5)","v":0},{"$f":"COUNTIF(F$15:F$189,\">=\"&$K$6)-COUNTIF(F$15:F$189,\">=\"&$K$5)","v":0},{"$f":"COUNTIF(G$15:G$189,\">=\"&$K$6)-COUNTIF(G$15:G$189,\">=\"&$K$5)","v":0},{"$f":"COUNTIF(H$15:H$189,\">=\"&$K$6)-COUNTIF(H$15:H$189,\">=\"&$K$5)","v":0},null,"Far to Go:",{"$f":"Cover!J15","v":2},null,null,null,null,0]
[null,{"$f":"\"Percent \"&Cover!$K$14&\" (Between \" & Cover!$J$14 & \" & \" & Cover!$J$13-1 & \")\"","v":"Percent CLOSE TO (Between 3 & 3)"},null,null,{"$f":"IF(E4=0,0,E7/E4)","v":0},{"$f":"IF(F4=0,0,F7/F4)","v":0},{"$f":"IF(G4=0,0,G7/G4)","v":0},{"$f":"IF(H4=0,0,H7/H4)","v":0},null,null,null,null,null,null,null,0]
[null,{"$f":"\"Number \"&Cover!$K$15&\" (Between \" & Cover!$J$15 & \" & \" & Cover!$J$14-1 & \")\"","v":"Number PROGRESSING (Between 2 & 2)"},null,null,{"$f":"COUNTIF(E$15:E$189,\">=\"&$K$7)-COUNTIF(E$15:E$189,\">=\"&$K$6)","v":0},{"$f":"COUNTIF(F$15:F$189,\">=\"&$K$7)-COUNTIF(F$15:F$189,\">=\"&$K$6)","v":0},{"$f":"COUNTIF(G$15:G$189,\">=\"&$K$7)-COUNTIF(G$15:G$189,\">=\"&$K$6)","v":0},{"$f":"COUNTIF(H$15:H$189,\">=\"&$K$7)-COUNTIF(H$15:H$189,\">=\"&$K$6)","v":0},null,null,null,null,null,null,null,0]
[null,{"$f":"\"Percent \"&Cover!$K$15&\" (Between \" & Cover!$J$15 & \" & \" & Cover!$J$14-1 & \")\"","v":"Percent PROGRESSING (Between 2 & 2)"},null,null,{"$f":"IF(E4=0,0,E9/E4)","v":0},{"$f":"IF(F4=0,0,F9/F4)","v":0},{"$f":"IF(G4=0,0,G9/G4)","v":0},{"$f":"IF(H4=0,0,H9/H4)","v":0},null,null,null,null,null,null,null,0]
[null,{"$f":"\"Number \"&Cover!$K$16&\" (Between \" & Cover!$J$16 & \" & \" & Cover!$J$15-1 & \")\"","v":"Number NEEDS PRACTICE (Between 1 & 1)"},null,null,{"$f":"COUNTIF(E$15:E$189,\"<\"&$K$7)","v":0},{"$f":"COUNTIF(F$15:F$189,\"<\"&$K$7)","v":0},{"$f":"COUNTIF(G$15:G$189,\"<\"&$K$7)","v":0},{"$f":"COUNTIF(H$15:H$189,\"<\"&$K$7)","v":0},null,null,null,null,null,null,null,0]
[null,{"$f":"\"Percent \"&Cover!$K$16&\" (Between \" & Cover!$J$16 & \" & \" & Cover!$J$15-1 & \")\"","v":"Percent NEEDS PRACTICE (Between 1 & 1)"},null,null,{"$f":"IF(E4=0,0,E11/E4)","v":0},{"$f":"IF(F4=0,0,F11/F4)","v":0},{"$f":"IF(G4=0,0,G11/G4)","v":0},{"$f":"IF(H4=0,0,H11/H4)","v":0},{"$f":"CONCATENATE(I15,I16,I17,I18,I19,I20,I21,I22,I23,I24,I25,I26,I27,I28,I29,I30,I31,I32,I33,I34,I35,I36,I37,I38,I39,I40,I41,I42,I43,I44,I45,I46,I47,I48,I49,I50,I51,I52,I53,I54,I55,I56,I57,I58,I59,I60,I61,I62,I63,I64,I65,I66,I67,I68,I69,I70,I71,I72,I73,I74,I75,I76,I77,I78,I79,I80,I81,I82,I83,I84,I85,I86,I87,I88,I89,I90,I91,I92,I93,I94,I95,I96,I97,I98,I99,I100,I101,I102,I103,I104,I105,I106,I107,I108,I109,I110,I111,I112,I113,I114,I115,I116,I117,I118,I119,I120,I121,I122,I123,I124,I125,I126,I127,I128,I129,I130,I131,I132,I133,I134,I135,I136,I137,I138,I139,I140,I141,I142,I143,I144,I145,I146,I147,I148,I149,I150,I151,I152,I153,I154,I155,I156,I157,I158,I159,I160,I161,I162,I163,I164)","v":""},{"$f":"CONCATENATE(J15,J16,J17,J18,J19,J20,J21,J22,J23,J24,J25,J26,J27,J28,J29,J30,J31,J32,J33,J34,J35,J36,J37,J38,J39,J40,J41,J42,J43,J44,J45,J46,J47,J48,J49,J50,J51,J52,J53,J54,J55,J56,J57,J58,J59,J60,J61,J62,J63,J64,J65,J66,J67,J68,J69,J70,J71,J72,J73,J74,J75,J76,J77,J78,J79,J80,J81,J82,J83,J84,J85,J86,J87,J88,J89,J90,J91,J92,J93,J94,J95,J96,J97,J98,J99,J100,J101,J102,J103,J104,J105,J106,J107,J108,J109,J110,J111,J112,J113,J114,J115,J116,J117,J118,J119,J120,J121,J122,J123,J124,J125,J126,J127,J128,J129,J130,J131,J132,J133,J134,J135,J136,J137,J138,J139,J140,J141,J142,J143,J144,J145,J146,J147,J148,J149,J150,J151,J152,J153,J154,J155,J156,J157,J158,J159,J160,J161,J162,J163,J164)","v":""},"","","","",null,0]
[]
[null,"Period","Student Number","Student Name",{"$f":"IF(Cover!J3=\"\",\"\",Cover!J3)","v":"CFA 1 Pre"},{"$f":"IF(Cover!J4=\"\",\"\",Cover!J4)","v":"CFA 2 Mid"},{"$f":"IF(Cover!J5=\"\",\"\",Cover!J5)","v":"CFA 3 Post"},{"$f":"IF(Cover!J6=\"\",\"\",Cover!J6)","v":"CFA 4"},"Pre Close","Pre Far Likely","Pre Extensive","Post Close","Post Far to Go ","Post Extensive",null,"Growth",null,"Return to Cover"]
[null,null,null,null,null,null,null,null,{"$f":"IF(E15>=$K$5,\"\",IF(E15>=$K$6,($D15&\", \"),\"\"))","v":""},{"$f":"IF(E15>=$K$6,\"\",IF(E15>=$K$7,($D15&\", \"),\"\"))","v":""},{"$f":"IF($E15=\"\",\"\",IF($E15<$K$7,$D15&\", \",\"\"))","v":""},{"$f":"IF(H15>=$K$5,\"\",IF(H15>=$K$6,($D15&\", \"),\"\"))","v":""},{"$f":"IF(H15>=$K$6,\"\",IF(H15>=$K$7,($D15&\", \"),\"\"))","v":""},{"$f":"IF($H15=\"\",\"\",IF($H15<$K$7,$D15&\", \",\"\"))","v":""},null,{"$f":"IF(H15<>\"\",H15-E15,IF(G15<>\"\",G15-E15,IF(F15<>\"\",F15-E15,IE15)))","v":0}]
[null,null,null,null,null,null,null,null,{"$f":"IF(E16>=$K$5,\"\",IF(E16>=$K$6,($D16&\", \"),\"\"))","v":""},"",{"$f":"IF($E16=\"\",\"\",IF($E16<$K$7,$D16&\", \",\"\"))","v":""},"","","",null,{"$f":"IF(H16<>\"\",H16-E16,IF(G16<>\"\",G16-E16,IF(F16<>\"\",F16-E16,IE16)))","v":0}]
[null,null,null,null,null,null,null,null,"","","","","","",null,0]
[null,null,null,null,null,null,null,null,"","","","","","",null,0]
[null,null,null,null,null,null,null,null,"","","","","","",null,0]
[null,null,null,null,null,null,null,null,"","","","","","",null,0]
[null,null,null,null,null,null,null,null,"","","","","","",null,0]
[null,null,null,null,null,null,null,null,"","","","","","",null,0]
[null,null,null,null,null,null,null,null,"","","","","","",null,0]
[null,null,null,null,null,null,null,null,"","","","","","",null,0]
[null,null,null,null,null,null,null,null,"","","","","","",null,0]
[null,null,null,null,null,null,null,null,"","","","","","",null,0]
[null,null,null,null,null,null,null,null,"","","","","","",null,0]
[null,null,null,null,null,null,null,null,"","","","","","",null,0]
[null,null,null,null,null,null,null,null,"","","","","","",null,0]
[null,null,null,null,null,null,null,null,"","","","","","",null,0]
[null,null,null,null,null,null,null,null,"","","","","","",null,0]
[null,null,null,null,null,null,null,null,"","","","","","",null,0]
[null,null,null,null,null,null,null,null,"","","","","","",null,0]
[null,null,null,null,null,null,null,null,"","","","","","",null,0]
[null,null,null,null,null,null,null,null,"","","","","","",null,0]
[null,null,null,null,null,null,null,null,"","","","","","",null,0]
[null,null,null,null,null,null,null,null,"","","","","","",null,0]
[null,null,null,null,null,null,null,null,"","","","","","",null,0]
[null,null,null,null,null,null,null,null,"","","","","","",null,0]
[null,null,null,null,null,null,null,null,"","","","","","",null,0]
[null,null,null,null,null,null,null,null,"","","","","","",null,0]
[null,null,null,null,null,null,null,null,"","","","","","",null,0]
[null,null,null,null,null,null,null,null,"","","","","","",null,0]
[null,null,null,null,null,null,null,null,"","","","","","",null,0]
[null,null,null,null,null,null,null,null,"","","","","","",null,0]
[null,null,null,null,null,null,null,null,"","","","","","",null,0]
[null,null,null,null,null,null,null,null,"","","",{"$f":"IF(H47>=$K$5,\"\",IF(H47>=$K$6,($D47&\", \"),\"\"))","v":""},{"$f":"IF(H47>=$K$6,\"\",IF(H47>=$K$7,($D47&\", \"),\"\"))","v":""},{"$f":"IF($H47=\"\",\"\",IF($H47<$K$7,$D47&\", \",\"\"))","v":""},null,0]
[null,null,null,null,null,null,null,null,"","","","","","",null,0]
[null,null,null,null,null,null,null,null,"","","","","","",null,0]
[null,null,null,null,null,null,null,null,"","","","","","",null,0]
[null,null,null,null,null,null,null,null,"","","","","","",null,0]
[null,null,null,null,null,null,null,null,"","","","","","",null,0]
[null,null,null,null,null,null,null,null,"","","","","","",null,0]
[null,null,null,null,null,null,null,null,"","","","","","",null,0]
[null,null,null,null,null,null,null,null,"","","","","","",null,0]
[null,null,null,null,null,null,null,null,"","","","","","",null,0]
[null,null,null,null,null,null,null,null,"","","","","","",null,0]
[null,null,null,null,null,null,null,null,"","","","","","",null,0]
[null,null,null,null,null,null,null,null,"","","","","","",null,0]
[null,null,null,null,null,null,null,null,"","","","","","",null,0]
[null,null,null,null,null,null,null,null,"","","","","","",null,0]
[null,null,null,null,null,null,null,null,"","","","","","",null,0]
[null,null,null,null,null,null,null,null,"","","","","","",null,0]
[null,null,null,null,null,null,null,null,"","","","","","",null,0]
[null,null,null,null,null,null,null,null,"","","","","","",null,0]
[null,null,null,null,null,null,null,null,"","","","","","",null,0]
[null,null,null,null,null,null,null,null,"","","","","","",null,0]
[null,null,null,null,null,null,null,null,"","","","","","",null,0]
[null,null,null,null,null,null,null,null,"","","","","","",null,0]
[null,null,null,null,null,null,null,null,"","","","","","",null,0]
[null,null,null,null,null,null,null,null,"","","","","","",null,0]
[null,null,null,null,null,null,null,null,"","","","","","",null,0]
[null,null,null,null,null,null,null,null,"","","","","","",null,0]
[null,null,null,null,null,null,null,null,"","","","","","",null,0]
[null,null,null,null,null,null,null,null,"","","","","","",null,0]
[null,null,null,null,null,null,null,null,"","","","","","",null,0]
[null,null,null,null,null,null,null,null,"","","","","","",null,0]
[null,null,null,null,null,null,null,null,"","","","","","",null,0]
[null,null,null,null,null,null,null,null,"",{"$f":"IF(E79>=$K$6,\"\",IF(E79>=$K$7,($D79&\", \"),\"\"))","v":""},"",{"$f":"IF(H79>=$K$5,\"\",IF(H79>=$K$6,($D79&\", \"),\"\"))","v":""},{"$f":"IF(H79>=$K$6,\"\",IF(H79>=$K$7,($D79&\", \"),\"\"))","v":""},{"$f":"IF($H79=\"\",\"\",IF($H79<$K$7,$D79&\", \",\"\"))","v":""},null,0]
[null,null,null,null,null,null,null,null,{"$f":"IF(E80>=$K$5,\"\",IF(E80>=$K$6,($D80&\", \"),\"\"))","v":""},"",{"$f":"IF($E80=\"\",\"\",IF($E80<$K$7,$D80&\", \",\"\"))","v":""},"","","",null,{"$f":"IF(H80<>\"\",H80-E80,IF(G80<>\"\",G80-E80,IF(F80<>\"\",F80-E80,IE80)))","v":0}]
[null,null,null,null,null,null,null,null,"","","","","","",null,0]
[null,null,null,null,null,null,null,null,"","","","","","",null,0]
[null,null,null,null,null,null,null,null,"","","","","","",null,0]
[null,null,null,null,null,null,null,null,"","","","","","",null,0]
[null,null,null,null,null,null,null,null,"","","","","","",null,0]
[null,null,null,null,null,null,null,null,"","","","","","",null,0]
[null,null,null,null,null,null,null,null,"","","","","","",null,0]
[null,null,null,null,null,null,null,null,"","","","","","",null,0]
[null,null,null,null,null,null,null,null,"","","","","","",null,0]
[null,null,null,null,null,null,null,null,"","","","","","",null,0]
[null,null,null,null,null,null,null,null,"","","","","","",null,0]
[null,null,null,null,null,null,null,null,"","","","","","",null,0]
[null,null,null,null,null,null,null,null,"","","","","","",null,0]
[null,null,null,null,null,null,null,null,"","","","","","",null,0]
[null,null,null,null,null,null,null,null,"","","","","","",null,0]
[null,null,null,null,null,null,null,null,"","","","","","",null,0]
[null,null,null,null,null,null,null,null,"","","","","","",null,0]
[null,null,null,null,null,null,null,null,"","","","","","",null,0]
[null,null,null,null,null,null,null,null,"","","","","","",null,0]
[null,null,null,null,null,null,null,null,"","","","","","",null,0]
[null,null,null,null,null,null,null,null,"","","","","","",null,0]
[null,null,null,null,null,null,null,null,"","","","","","",null,0]
[null,null,null,null,null,null,null,null,"","","","","","",null,0]
[null,null,null,null,null,null,null,null,"","","","","","",null,0]
[null,null,null,null,null,null,null,null,"","","","","","",null,0]
[null,null,null,null,null,null,null,null,"","","","","","",null,0]
[null,null,null,null,null,null,null,null,"","","","","","",null,0]
[null,null,null,null,null,null,null,null,"","","","","","",null,0]
[null,null,null,null,null,null,null,null,"","","","","","",null,0]
[null,null,null,null,null,null,null,null,"","","","","","",null,0]
[null,null,null,null,null,null,null,null,"","","",{"$f":"IF(H111>=$K$5,\"\",IF(H111>=$K$6,($D111&\", \"),\"\"))","v":""},{"$f":"IF(H111>=$K$6,\"\",IF(H111>=$K$7,($D111&\", \"),\"\"))","v":""},{"$f":"IF($H111=\"\",\"\",IF($H111<$K$7,$D111&\", \",\"\"))","v":""},null,0]
[null,null,null,null,null,null,null,null,"","","","","","",null,0]
[null,null,null,null,null,null,null,null,"","","","","","",null,0]
[null,null,null,null,null,null,null,null,"","","","","","",null,0]
[null,null,null,null,null,null,null,null,"","","","","","",null,0]
[null,null,null,null,null,null,null,null,"","","","","","",null,0]
[null,null,null,null,null,null,null,null,"","","","","","",null,0]
[null,null,null,null,null,null,null,null,"","","","","","",null,0]
[null,null,null,null,null,null,null,null,"","","","","","",null,0]
[null,null,null,null,null,null,null,null,"","","","","","",null,0]
[null,null,null,null,null,null,null,null,"","","","","","",null,0]
[null,null,null,null,null,null,null,null,"","","","","","",null,0]
[null,null,null,null,null,null,null,null,"","","","","","",null,0]
[null,null,null,null,null,null,null,null,"","","","","","",null,0]
[null,null,null,null,null,null,null,null,"","","","","","",null,0]
[null,null,null,null,null,null,null,null,"","","","","","",null,0]
[null,null,null,null,null,null,null,null,"","","","","","",null,0]
[null,null,null,null,null,null,null,null,"","","","","","",null,0]
[null,null,null,null,null,null,null,null,"","","","","","",null,0]
[null,null,null,null,null,null,null,null,"","","","","","",null,0]
[null,null,null,null,null,null,null,null,"","","","","","",null,0]
[null,null,null,null,null,null,null,null,"","","","","","",null,0]
[null,null,null,null,null,null,null,null,"","","","","","",null,0]
[null,null,null,null,null,null,null,null,"","","","","","",null,0]
[null,null,null,null,null,null,null,null,"","","","","","",null,0]
[null,null,null,null,null,null,null,null,"","","","","","",null,0]
[null,null,null,null,null,null,null,null,"","","","","","",null,0]
[null,null,null,null,null,null,null,null,"","","","","","",null,0]
[null,null,null,null,null,null,null,null,"","","","","","",null,0]
[null,null,null,null,null,null,null,null,"","","","","","",null,0]
[null,null,null,null,null,null,null,null,"","","","","","",null,0]
[null,null,null,null,null,null,null,null,"","","","","","",null,0]
[null,null,null,null,null,null,null,null,"",{"$f":"IF(E143>=$K$6,\"\",IF(E143>=$K$7,($D143&\", \"),\"\"))","v":""},"",{"$f":"IF(H143>=$K$5,\"\",IF(H143>=$K$6,($D143&\", \"),\"\"))","v":""},{"$f":"IF(H143>=$K$6,\"\",IF(H143>=$K$7,($D143&\", \"),\"\"))","v":""},{"$f":"IF($H143=\"\",\"\",IF($H143<$K$7,$D143&\", \",\"\"))","v":""},null,0]
[null,null,null,null,null,null,null,null,{"$f":"IF(E144>=$K$5,\"\",IF(E144>=$K$6,($D144&\", \"),\"\"))","v":""},"",{"$f":"IF($E144=\"\",\"\",IF($E144<$K$7,$D144&\", \",\"\"))","v":""},"","","",null,{"$f":"IF(H144<>\"\",H144-E144,IF(G144<>\"\",G144-E144,IF(F144<>\"\",F144-E144,IE144)))","v":0}]
[null,null,null,null,null,null,null,null,"","","","","","",null,0]
[null,null,null,null,null,null,null,null,"","","","","","",null,0]
[null,null,null,null,null,null,null,null,"","","","","","",null,0]
[null,null,null,null,null,null,null,null,"","","","","","",null,0]
[null,null,null,null,null,null,null,null,"","","","","","",null,0]
[null,null,null,null,null,null,null,null,"","","","","","",null,0]
[null,null,null,null,null,null,null,null,"","","","","","",null,0]
[null,null,null,null,null,null,null,null,"","","","","","",null,0]
[null,null,null,null,null,null,null,null,"","","","","","",null,0]
[null,null,null,null,null,null,null,null,"","","","","","",null,0]
[null,null,null,null,null,null,null,null,"","","","","","",null,0]
[null,null,null,null,null,null,null,null,"","","","","","",null,0]
[null,null,null,null,null,null,null,null,"","","","","","",null,0]
[null,null,null,null,null,null,null,null,"","","","","","",null,0]
[null,null,null,null,null,null,null,null,"","","","","","",null,0]
[null,null,null,null,null,null,null,null,"","","","","","",null,0]
[null,null,null,null,null,null,null,null,"","","","","","",null,0]
[null,null,null,null,null,null,null,null,"","","","","","",null,0]
[null,null,null,null,null,null,null,null,"","","","","","",null,0]
[null,null,null,null,null,null,null,null,"","","","","","",null,0]
[null,null,null,null,null,null,null,null,null,null,null,null,null,null,null,0]
[null,null,null,null,null,null,null,null,null,null,null,null,null,null,null,0]
[null,null,null,null,null,null,null,null,null,null,null,null,null,null,null,0]
[null,null,null,null,null,null,null,null,null,null,null,null,null,null,null,0]
[null,null,null,null,null,null,null,null,null,null,null,null,null,null,null,0]
[null,null,null,null,null,null,null,null,null,null,null,null,null,null,null,0]
[null,null,null,null,null,null,null,null,null,null,null,null,null,null,null,0]
[null,null,null,null,null,null,null,null,null,null,null,null,null,null,null,0]
[null,null,null,null,null,null,null,null,null,null,null,null,null,null,null,0]
[null,null,null,null,null,null,null,null,null,null,null,null,null,null,null,0]
[null,null,null,null,null,null,null,null,null,null,null,null,null,null,null,0]
[null,null,null,null,null,null,null,null,null,null,null,null,null,null,null,0]
[null,null,null,null,null,null,null,null,null,null,null,null,null,null,null,0]
[null,null,null,null,null,null,null,null,null,null,null,null,null,null,null,0]
[null,null,null,null,null,null,null,null,null,null,null,null,null,null,null,0]
[null,null,null,null,null,null,null,null,null,null,null,null,null,null,null,0]
[null,null,null,null,null,null,null,null,null,null,null,null,null,null,null,0]
[null,null,null,null,null,null,null,null,null,null,null,null,null,null,null,0]
[null,null,null,null,null,null,null,null,null,null,null,null,null,null,null,0]
[null,null,null,null,null,null,null,null,null,null,null,null,null,null,null,0]
[null,null,null,null,null,null,null,null,null,null,null,null,null,null,null,0]
[null,null,null,null,null,null,null,null,null,null,null,null,null,null,null,0]
[null,null,null,null,null,null,null,null,null,null,null,null,null,null,null,0]
[null,null,null,null,null,null,null,null,null,null,null,null,null,null,null,0]
[null,null,null,null,null,null,null,null,null,null,null,null,null,null,null,{"$f":"IF(H189<>\"\",H189-E189,IF(G189<>\"\",G189-E189,IF(F189<>\"\",F189-E189,IE189)))","v":0}]

{"sheet":"Tools","index":14,"n_rows":39,"n_cols":35,"rows_kept":39,"cut":false,"hidden":true,"merged":[[7,34,7,35],[2,21,2,22],[2,25,2,26],[2,29,2,30],[2,34,2,35],[4,34,4,35],[5,21,5,22],[5,25,5,26],[5,29,5,30],[5,34,5,35]]}
[]
[null,null,null,null,null,null,null,null,null,null,"Priority","Notes"]
[null,null,null,null,null,null,null,null,null,"done",3,"Add section to allow users to label performance levels",null,null,null,null,null,null,null,"Goal1","Group:","Grade 5 ",null,null,"Topic:","Comprehension",null,null,"End of Unit Date:","Oct. 31st",null,null,null,"Assessment Tool:","CFA"]
[null,null,null,null,null,null,null,null,null,"done",1,"change macros to reflect 8 teachers"]
[null,null,null,null,null,null,null,null,null,null,null,"add export to Word that synopsizes the minutes",null,null,null,null,null,null,null,null,null,null,null,null,null,null,"Adjustment:",0.1,null,null,null,null,null,"Assessment Date:","Oct. 28th"]
[null,null,null,null,null,null,null,null,null,null,null,"add export to word that make summary for leadership",null,null,null,null,null,null,null,"Goal 2","Group:","Grade 5",null,null,"Topic:","Comprehension",null,null,"End of Unit Date:","Oct 31st",null,null,null,"Assessment Tool:","CFA"]
[null,null,null,null,null,null,null,null,null,"done",null,"change graph page"]
[null,null,null,null,null,null,null,null,null,null,null,"change teacher page to count students not likely",null,null,null,null,null,null,null,null,null,null,null,null,null,null,"Adjustment:",-0.05,null,null,null,null,null,"Assessment Date:","Oct 28th"]
[]
[]
[]
[]
[null,null,null,null,null,null,null,null,null,null,"Test Data for Teacher Pages"]
[null,"Tchr1","Tchr2","Tchr3","Tchr4","Tchr5","Tchr6","Tchr7","Tchr8",null,"Tchr1",null,"Tchr2",null,"Tchr3",null,"Tchr4",null,"Tchr5",null,"Tchr6",null,"Tchr7",null,"Tchr8"]
[null,"Amy","Andy","Arnie","Ariel","Andrew","Andy","Annie","Amy",null,40,100,80,100,40,80,20,80,30,50,70,100,10,30,30,90]
[null,"Bill","Britney","Bob","Bob C.","Brent","Britney","Brent","Bill",null,20,50,10,70,60,100,80,100,80,100,10,50,20,40,10,60]
[null,"Carol","Carl","Cara","Carrie","Callie","Carl","Connor","Carol",null,40,100,40,60,40,100,60,90,70,100,60,80,30,70,70,100]
[null,"Dave","Dana","Dan","Deke","Deena","Dana","Dilbert","Dave",null,80,100,0,60,0,50,20,80,80,100,70,90,30,80,70,100]
[null,"Emma","Eric","Erica","Ella","Eric S.","Eric","Elmer","Emma",null,50,70,50,90,40,90,0,50,0,20,10,30,20,60,20,40]
[null,"Frank","Fran","Fred","Fred A.","Fred D.","Fran","Fritz","Frank",null,0,50,60,90,30,70,70,90,30,60,80,100,80,100,60,80]
[null,"Greta","Gerry","Gertrude","Gretchen","Ginger","Gertrude","Greg","Gertrude",null,80,100,30,50,70,100,40,90,20,60,80,100,10,70,70,100]
[null,"Hank","Hanna","Harry","Harold","Hannah Z.","Harry","Honor","Harry",null,0,50,80,100,10,50,0,30,10,70,30,60,80,100,0,40]
[null,"Ima","Ike","Iris","Irene","Ike","Iris","Imma","Iris",null,70,100,70,90,30,90,80,100,30,50,20,70,60,100,80,100]
[null,"Jake","Julie","John","Jimmy","Jerry","John","Jimmy","John",null,0,40,50,100,60,90,60,90,10,70,30,80,80,100,30,80]
[null,"Kate","Kelly","Kerry","Kate","Kira","Kerry","Kristopher","Kerry",null,60,90,30,90,50,90,50,70,0,30,0,60,60,100,80,100]
[null,"Luke","Larry","Lawrence","Luca","Laura","Lawrence","Luca","Lawrence",null,50,70,50,100,80,100,60,80,70,100,50,80,70,90,60,100]
[null,"Meena","Mary","Michelle","Mira","Mike","Mira","Martin","Michelle",null,60,100,60,100,0,40,30,50,80,100,50,90,80,100,70,90]
[null,"Ned","Neal","Nate","Norbert","Nathan","Norbert","Nina","Norbert",null,80,100,30,60,40,80,60,80,60,100,0,50,20,40,70,100]
[null,"Ona","Orina","Orrie","Ollie","Olivia","Ollie","Oliver","Ollie",null,70,90,0,60,0,60,80,100,50,100,10,40,30,70,40,80]
[null,"Paul","Pete","Pat","Peter","Paula","Peter","Patrick","Peter",null,60,100,10,40,20,80,50,100,40,70,70,100,30,90,10,30]
[null,"Qita","Qi","Greta","Billy","Anthony G.","Billy","Joeseph","Billy",null,20,60,0,20,40,60,0,60,10,60,80,100,0,30,70,100]
[null,"Rick","Ron","Ronnie","Roger","Ronnie","Roger","Rachel","Ronnie",null,50,90,40,100,40,70,40,60,20,70,80,100,50,90,20,40]
[null,"Sara","Susy","Sally","Sarah","Sandra","Sarah","Samuel","Sandra",null,40,60,70,100,60,90,70,100,10,30,0,30,40,60,80,100]
[null,"Tom","Terry","Tony","Tommy","Torrie","Thomas","Tina","Torrie",null,20,80,50,100,30,60,80,100,0,30,60,80,0,20,40,90]
[null,"Uma","Unka","Andy","Ulrich","Billy","Jonathan","Johnnie","Billy",null,30,60,60,60,10,10,30,30,80,70,50,70,10,30,0,-10]
[null,"Victor","Van","Vern","Vale","Cassie","Fred","Phillip","Fred",null,50,60,70,70,80,100,0,30,40,80,40,50,40,60,30,50]
[null,"Weena","Willie","Will","Wanda","Will T.","Walter","Wednesday","Walter",null,20,30,40,40,60,70,50,40,80,80,60,100,40,50,30,50]
[null,"Xuan","Aria","Charles","Sam","Jake J.","David","Carson","David",null,40,60,20,60,60,50,20,30,50,90,50,50,40,80,10,0]
[null,"Yi","Bill","Dave","Zeke","Owen","Stephanie","Eva","Stephanie",null,10,20,40,80,20,50,0,0,40,50,70,90,20,30,0,0]